program: Orca
programVersion: 5.0.2
elementType: O O N C C C C C C C C C C C C C C C C C C H H H H H H H H H H H H H H H H H H H H H H H H H H H H H H H H H H H
charge: 0
multiplicity: 1
keywords: wb97x-d3
keywords: def2-TZVPP
keywords: def2/J RIJCOSX
keywords: DEFGRID2
keywords: scfconv7
keywords: smallprint printgap noloewdin
keywords: NOSOSCF
formula: C18H35NO2
InChI: InChI=1/C18H35NO2/c1-6-12-19(7-2)13-16-14-20-18(21-16)10-8-15(9-11-18)17(3,4)5/h15-16H,6-14H2,1-5H3
56 atoms
O  -0.353642 1.16814 -0.75927
O  -0.379089 2.514044 1.052027
N  -2.812802 -0.388712 -0.197593
C  2.937818 0.000431 0.109343
C  0.40571 1.561729 0.37245
C  2.630654 1.219378 -0.766624
C  1.621048 -0.650988 0.543804
C  3.949644 -0.987235 -0.531327
C  1.705483 2.213086 -0.070517
C  0.697148 0.343648 1.241673
C  -1.64494 1.751424 -0.710117
C  -1.729902 2.27456 0.714885
C  3.43977 -1.56559 -1.852726
C  5.278336 -0.269866 -0.789696
C  4.229475 -2.144228 0.433207
C  -2.725787 0.750658 -1.09149
C  -4.114221 -0.531067 0.431599
C  -2.264531 -1.613816 -0.753405
C  -4.143386 -1.52326 1.586115
C  -3.108012 -2.310735 -1.817138
C  -3.170149 -1.195567 2.70793
H  3.421846 0.376396 1.023229
H  3.549734 1.742123 -1.036665
H  2.173677 0.899983 -1.707842
H  1.109043 -1.081574 -0.322345
H  1.806866 -1.479433 1.228995
H  1.485591 3.056638 -0.731215
H  2.207032 2.621976 0.812339
H  1.170646 0.688193 2.166592
H  -0.238853 -0.146287 1.526315
H  -1.695327 2.586085 -1.423206
H  -2.187525 1.540505 1.387178
H  -2.286491 3.209614 0.789938
H  4.165067 -2.27142 -2.264835
H  2.500342 -2.108044 -1.730591
H  3.280849 -0.795087 -2.609199
H  5.196282 0.506616 -1.551529
H  6.035537 -0.976277 -1.137878
H  5.66306 0.199057 0.119702
H  4.533843 -1.781213 1.418238
H  3.362778 -2.791524 0.572608
H  5.03772 -2.773658 0.053867
H  -2.560884 0.440433 -2.129903
H  -3.6721 1.300968 -1.109716
H  -4.396793 0.44968 0.825574
H  -4.902659 -0.803514 -0.288799
H  -1.284915 -1.379548 -1.173969
H  -2.068722 -2.317053 0.060923
H  -3.967515 -2.541061 1.226107
H  -5.163742 -1.525011 1.979421
H  -2.571296 -3.176804 -2.208281
H  -4.059108 -2.67114 -1.422016
H  -3.326535 -1.654884 -2.662217
H  -3.302228 -1.873383 3.552731
H  -3.322306 -0.179567 3.078708
H  -2.131253 -1.275028 2.386634
elementType: O N C H
totalener: -912.31176494 hartree
nucrepener: 1947.20314386 hartree
electener: -2859.51490880 hartree
oneelecener: -5108.33217278 hartree
twoeener: 2248.81726398 hartree
cpcmener: -0.01493380 hartree
kineticenergy: 907.79503917 hartree
xcener: -92.075477175082 hartree
chargesum: 0.0000000
charge: -0.428673 -0.395941 -0.209910 0.109348 0.592956 -0.222596 -0.273610 0.262485 -0.279971 -0.245849 0.205550 -0.010367 -0.377239 -0.356712 -0.361002 -0.119183 -0.132415 -0.083451 -0.076139 -0.281324 -0.297235 0.057042 0.088947 0.076823 0.086164 0.087353 0.077903 0.082049 0.088366 0.050343 0.069479 0.067195 0.104175 0.097454 0.095451 0.096655 0.094953 0.093978 0.098098 0.098578 0.094288 0.094965 0.090336 0.089176 0.093250 0.087741 0.079130 0.082194 0.061784 0.071666 0.094441 0.083221 0.082805 0.102892 0.081121 0.081259
qa: -0.4287 -0.3959 -0.2099 0.1093 0.5930 -0.2226 -0.2736 0.2625 -0.2800 -0.2458 0.2055 -0.0104 -0.3772 -0.3567 -0.3610 -0.1192 -0.1324 -0.0835 -0.0761 -0.2813 -0.2972 0.0570 0.0889 0.0768 0.0862 0.0874 0.0779 0.0820 0.0884 0.0503 0.0695 0.0672 0.1042 0.0975 0.0955 0.0967 0.0950 0.0940 0.0981 0.0986 0.0943 0.0950 0.0903 0.0892 0.0933 0.0877 0.0791 0.0822 0.0618 0.0717 0.0944 0.0832 0.0828 0.1029 0.0811 0.0813
va: 1.9817 2.0060 2.7984 3.6672 3.7651 3.9119 3.9849 3.6725 4.0745 4.0162 3.8927 3.9894 3.9468 3.9209 3.9246 3.9296 3.9262 3.9599 3.8267 3.9296 3.9510 1.0174 1.0134 1.0218 0.9959 1.0146 1.0245 1.0170 1.0247 1.0384 1.0044 1.0045 0.9944 1.0050 1.0014 0.9996 1.0004 1.0068 1.0029 1.0028 0.9980 1.0071 1.0043 1.0065 0.9911 0.9978 1.0051 0.9881 1.0039 1.0109 1.0089 0.9987 1.0034 1.0068 0.9992 0.9919
dispcorr: -0.031272404 hartree
energy: -912.343037345157
dipole: 3.26629 -4.09039 -0.82410 -15.51702 15.17203 -0.34499 -0.96301 0.72155 -0.24145
magnitude: 0.92545 au
magnitude: 2.35231 debye
