program: Orca
programVersion: 5.0.2
elementType: O O N C C C C C C C C C C C C C C C C C C H H H H H H H H H H H H H H H H H H H H H H H H H H H H H H H H H H H
charge: 0
multiplicity: 1
keywords: wb97x-d3
keywords: def2-TZVPP
keywords: def2/J RIJCOSX
keywords: DEFGRID2
keywords: scfconv7
keywords: smallprint printgap noloewdin
keywords: NOSOSCF
formula: C18H35NO2
InChI: InChI=1/C18H35NO2/c1-6-12-19(7-2)13-16-14-20-18(21-16)10-8-15(9-11-18)17(3,4)5/h15-16H,6-14H2,1-5H3
56 atoms
O  -0.037019 -0.013909 -0.493142
O  -0.459612 2.135351 0.05395
N  -3.686844 -0.186065 0.084157
C  3.471998 0.498332 0.194888
C  0.58072 1.195151 -0.067949
C  2.79709 0.661489 -1.170508
C  2.424798 0.047898 1.218817
C  4.74515 -0.38957 0.170844
C  1.614785 1.624964 -1.103446
C  1.239269 1.005204 1.287805
C  -1.411185 0.221058 -0.767948
C  -1.486661 1.737466 -0.831215
C  4.427801 -1.85166 -0.148943
C  5.730796 0.138043 -0.876738
C  5.443061 -0.322588 1.532826
C  -2.273734 -0.382029 0.337817
C  -4.273458 -1.163963 -0.815354
C  -4.471287 0.045763 1.286301
C  -4.454743 -2.586617 -0.283113
C  -4.269214 1.437129 1.86316
C  -5.125629 -3.480759 -1.315065
H  3.810566 1.499753 0.500461
H  3.504568 1.046473 -1.906533
H  2.461944 -0.30963 -1.547962
H  2.064899 -0.955133 0.970702
H  2.862664 -0.023616 2.215859
H  1.146368 1.718805 -2.087786
H  1.979112 2.620315 -0.829892
H  1.57993 1.9818 1.645745
H  0.497829 0.643126 2.005758
H  -1.658303 -0.231477 -1.733018
H  -2.438723 2.135892 -0.480414
H  -1.313295 2.110057 -1.847944
H  3.910453 -1.962871 -1.103982
H  5.348656 -2.436552 -0.213931
H  3.807392 -2.318297 0.618241
H  6.691481 -0.375198 -0.790927
H  5.920472 1.206948 -0.748231
H  5.380219 -0.015936 -1.898352
H  5.674602 0.708665 1.811775
H  4.842761 -0.754262 2.334842
H  6.386168 -0.873809 1.510638
H  -2.008643 0.105098 1.279603
H  -2.004124 -1.440927 0.462729
H  -5.2516 -0.783483 -1.129516
H  -3.668699 -1.20439 -1.726834
H  -5.52621 -0.065842 1.022609
H  -4.274284 -0.703532 2.068041
H  -5.059688 -2.571016 0.627955
H  -3.488218 -3.015546 -0.004413
H  -4.568837 2.205352 1.148834
H  -4.873954 1.562756 2.762935
H  -3.23218 1.627221 2.144716
H  -6.112651 -3.101116 -1.587963
H  -5.259434 -4.495902 -0.938894
H  -4.536085 -3.547338 -2.23195
elementType: O N C H
totalener: -912.31483272 hartree
nucrepener: 1872.36541179 hartree
electener: -2784.68024451 hartree
oneelecener: -4958.31582983 hartree
twoeener: 2173.63558533 hartree
cpcmener: -0.01490486 hartree
kineticenergy: 907.78970498 hartree
xcener: -92.069891560804 hartree
chargesum: -0.0000000
charge: -0.436294 -0.400211 -0.237203 0.086568 0.559981 -0.224697 -0.224163 0.257677 -0.273734 -0.272871 0.276614 -0.021004 -0.372920 -0.359979 -0.356238 -0.224478 -0.091650 -0.045899 -0.080718 -0.276261 -0.279260 0.056012 0.086100 0.076593 0.078806 0.087828 0.082921 0.079078 0.087002 0.082491 0.092224 0.098026 0.089656 0.098466 0.097459 0.094506 0.094558 0.099185 0.093623 0.097132 0.094389 0.094415 0.111344 0.092804 0.082019 0.079969 0.078752 0.069064 0.060403 0.059787 0.075591 0.095074 0.080945 0.078682 0.091353 0.080481
qa: -0.4363 -0.4002 -0.2372 0.0866 0.5600 -0.2247 -0.2242 0.2577 -0.2737 -0.2729 0.2766 -0.0210 -0.3729 -0.3600 -0.3562 -0.2245 -0.0917 -0.0459 -0.0807 -0.2763 -0.2793 0.0560 0.0861 0.0766 0.0788 0.0878 0.0829 0.0791 0.0870 0.0825 0.0922 0.0980 0.0897 0.0985 0.0975 0.0945 0.0946 0.0992 0.0936 0.0971 0.0944 0.0944 0.1113 0.0928 0.0820 0.0800 0.0788 0.0691 0.0604 0.0598 0.0756 0.0951 0.0809 0.0787 0.0914 0.0805
va: 1.9899 1.9943 2.8419 3.6859 3.8131 3.9261 3.9284 3.6732 4.0672 4.0412 3.7754 3.9583 3.9460 3.9264 3.9223 3.9765 3.9895 3.8972 3.8218 3.9230 3.9550 1.0170 1.0126 1.0225 1.0188 1.0146 1.0142 1.0217 1.0177 1.0200 1.0027 1.0148 0.9959 1.0009 1.0045 0.9997 1.0073 1.0023 0.9977 1.0032 1.0016 1.0062 0.9946 1.0179 0.9985 0.9979 0.9913 0.9933 1.0084 1.0108 1.0104 1.0111 1.0043 1.0018 1.0023 1.0013
dispcorr: -0.028380123 hartree
energy: -912.343212838289
dipole: 2.45180 -2.85903 -0.40723 -9.63463 9.28751 -0.34712 1.88094 -2.00571 -0.12477
magnitude: 0.54945 au
magnitude: 1.39660 debye
