program: Orca
programVersion: 5.0.2
elementType: O O N C C C C C C C C C C C C C C C C C C H H H H H H H H H H H H H H H H H H H H H H H H H H H H H H H H H H H
charge: 0
multiplicity: 1
keywords: wb97x-d3
keywords: def2-TZVPP
keywords: def2/J RIJCOSX
keywords: DEFGRID2
keywords: scfconv7
keywords: smallprint printgap noloewdin
keywords: NOSOSCF
formula: C18H35NO2
InChI: InChI=1/C18H35NO2/c1-6-12-19(7-2)13-16-14-20-18(21-16)10-8-15(9-11-18)17(3,4)5/h15-16H,6-14H2,1-5H3
56 atoms
O  -0.605478 0.812999 0.437461
O  -0.116034 2.946445 0.923165
N  -3.434579 -0.310109 -0.322397
C  2.896262 0.076239 -0.045692
C  0.471248 1.709881 0.556482
C  1.937118 0.549778 -1.141617
C  2.120423 -0.066537 1.267111
C  3.719369 -1.181476 -0.43488
C  1.231451 1.846935 -0.759758
C  1.401241 1.224784 1.651939
C  -1.709518 1.551639 -0.056595
C  -1.492134 2.91858 0.595341
C  2.82765 -2.3764 -0.77893
C  4.601913 -0.862026 -1.646148
C  4.64678 -1.576784 0.718039
C  -3.034834 0.915064 0.337821
C  -2.649878 -1.493701 -0.00599
C  -3.633063 -0.148032 -1.754607
C  -2.615801 -1.85491 1.471159
C  -4.644102 -1.121999 -2.337499
C  -1.90302 -3.180115 1.699938
H  3.632615 0.88009 0.106795
H  2.469079 0.711839 -2.0810
H  1.18853 -0.222949 -1.344696
H  1.393853 -0.882126 1.191964
H  2.791463 -0.331612 2.085672
H  0.555821 2.159535 -1.561903
H  1.969716 2.647615 -0.649314
H  2.140501 2.007986 1.844893
H  0.835152 1.085357 2.577269
H  -1.648493 1.640969 -1.149426
H  -2.091455 3.029046 1.507164
H  -1.750437 3.738612 -0.079606
H  2.162546 -2.648669 0.043338
H  2.206998 -2.18937 -1.65721
H  3.437743 -3.25541 -1.001391
H  4.021989 -0.655523 -2.546807
H  5.259047 -1.703627 -1.878494
H  5.238574 0.006685 -1.457699
H  4.102109 -1.957879 1.583148
H  5.334532 -2.365649 0.403273
H  5.253607 -0.731524 1.054404
H  -3.810064 1.662569 0.137742
H  -3.042022 0.769838 1.421603
H  -3.105101 -2.334553 -0.536367
H  -1.618757 -1.430546 -0.39005
H  -4.000183 0.866642 -1.931162
H  -2.688015 -0.230608 -2.315653
H  -3.639134 -1.912947 1.852971
H  -2.108671 -1.080831 2.051777
H  -5.610501 -1.027276 -1.840104
H  -4.79252 -0.914784 -3.39829
H  -4.326016 -2.162176 -2.258143
H  -2.390556 -3.997651 1.164392
H  -1.889784 -3.444274 2.758144
H  -0.864984 -3.13766 1.361224
elementType: O N C H
totalener: -912.31508145 hartree
nucrepener: 1933.14767702 hartree
electener: -2845.46275848 hartree
oneelecener: -5079.73873105 hartree
twoeener: 2234.27597257 hartree
cpcmener: -0.01619498 hartree
kineticenergy: 907.77732850 hartree
xcener: -92.068393627420 hartree
chargesum: -0.0000000
charge: -0.379809 -0.404726 -0.203183 0.095360 0.564111 -0.247021 -0.227644 0.262248 -0.282262 -0.242239 0.117799 0.036815 -0.376834 -0.358586 -0.359530 -0.167939 -0.113214 -0.037582 -0.077289 -0.270259 -0.279785 0.057597 0.087995 0.079904 0.074520 0.086667 0.088631 0.085974 0.085483 0.077847 0.088745 0.073352 0.084320 0.097125 0.094186 0.098587 0.094143 0.095004 0.097217 0.094256 0.094418 0.099557 0.105402 0.095514 0.098748 0.058608 0.084866 0.063551 0.062144 0.056011 0.072967 0.088782 0.080017 0.082102 0.092005 0.075322
qa: -0.3798 -0.4047 -0.2032 0.0954 0.5641 -0.2470 -0.2276 0.2622 -0.2823 -0.2422 0.1178 0.0368 -0.3768 -0.3586 -0.3595 -0.1679 -0.1132 -0.0376 -0.0773 -0.2703 -0.2798 0.0576 0.0880 0.0799 0.0745 0.0867 0.0886 0.0860 0.0855 0.0778 0.0887 0.0734 0.0843 0.0971 0.0942 0.0986 0.0941 0.0950 0.0972 0.0943 0.0944 0.0996 0.1054 0.0955 0.0987 0.0586 0.0849 0.0636 0.0621 0.0560 0.0730 0.0888 0.0800 0.0821 0.0920 0.0753
va: 1.9935 2.0027 2.8973 3.6686 3.7894 3.9632 3.9533 3.6714 4.0273 4.0025 3.8083 3.9824 3.9537 3.9230 3.9244 4.0382 3.9638 3.8864 3.8190 3.9316 3.9543 1.0168 1.0146 1.0100 1.0088 1.0130 1.0098 1.0228 1.0182 1.0311 0.9923 0.9935 0.9951 0.9984 0.9995 1.0052 1.0015 1.0062 1.0033 0.9979 1.0075 1.0020 0.9987 0.9999 0.9886 1.0064 0.9908 0.9969 1.0200 1.0197 1.0141 1.0071 1.0024 1.0013 1.0041 0.9998
dispcorr: -0.029550478 hartree
energy: -912.344631930875
dipole: 4.84341 -4.88249 -0.03908 -16.43425 16.56130 0.12705 -5.08433 4.40451 -0.67981
magnitude: 0.69269 au
magnitude: 1.76067 debye
