program: Orca
programVersion: 5.0.2
elementType: O O N C C C C C C C C C C C C C C C C C C H H H H H H H H H H H H H H H H H H H H H H H H H H H H H H H H H H H
charge: 0
multiplicity: 1
keywords: wb97x-d3
keywords: def2-TZVPP
keywords: def2/J RIJCOSX
keywords: DEFGRID2
keywords: scfconv7
keywords: smallprint printgap noloewdin
keywords: NOSOSCF
formula: C18H35NO2
InChI: InChI=1/C18H35NO2/c1-6-12-19(7-2)13-16-14-20-18(21-16)10-8-15(9-11-18)17(3,4)5/h15-16H,6-14H2,1-5H3
56 atoms
O  -0.457893 0.86192 0.022993
O  -0.038524 3.035194 0.497724
N  -3.284997 -0.46139 -0.086093
C  3.076866 0.189098 -0.104461
C  0.587704 1.794712 0.238462
C  2.211267 0.624545 -1.291516
C  2.189059 0.052616 1.136676
C  3.955785 -1.056918 -0.393143
C  1.454038 1.918199 -1.005487
C  1.423505 1.340438 1.427541
C  -1.706129 1.536332 0.015354
C  -1.392499 2.790745 0.810989
C  3.120521 -2.284272 -0.762448
C  4.918561 -0.751852 -1.545273
C  4.804029 -1.393864 0.837596
C  -2.8086 0.69273 0.642958
C  -2.416519 -1.6325 -0.069212
C  -3.851492 -0.144302 -1.382612
C  -3.070971 -2.857766 0.562186
C  -4.816536 -1.197797 -1.900366
C  -3.396663 -2.659106 2.03393
H  3.78051 1.010444 0.09883
H  2.821663 0.775023 -2.183801
H  1.494764 -0.163969 -1.540403
H  1.483348 -0.774443 1.011082
H  2.788947 -0.189238 2.015494
H  0.830045 2.192576 -1.861322
H  2.167303 2.735371 -0.857604
H  2.136518 2.136172 1.664678
H  0.78222 1.214209 2.305043
H  -1.978011 1.80979 -1.01369
H  -1.538543 2.630718 1.888666
H  -1.992977 3.649896 0.508799
H  2.419378 -2.560332 0.027394
H  2.54534 -2.132106 -1.677469
H  3.767616 -3.148398 -0.931969
H  5.509667 0.145701 -1.344636
H  4.403981 -0.601515 -2.495312
H  5.618585 -1.577921 -1.690759
H  5.363188 -0.523272 1.191309
H  4.206265 -1.765009 1.671288
H  5.532155 -2.172546 0.597921
H  -3.658777 1.365277 0.807524
H  -2.479513 0.373074 1.636204
H  -2.082319 -1.876335 -1.085636
H  -1.504516 -1.412455 0.490632
H  -4.39462 0.800244 -1.285568
H  -3.077113 0.025557 -2.14855
H  -2.389828 -3.70731 0.449788
H  -3.980561 -3.120897 0.015895
H  -4.322162 -2.146717 -2.112663
H  -5.619963 -1.384608 -1.186177
H  -5.270602 -0.857594 -2.832951
H  -3.875044 -3.542647 2.460251
H  -4.076159 -1.818252 2.180532
H  -2.49413 -2.463117 2.617975
elementType: O N C H
totalener: -912.31252543 hartree
nucrepener: 1912.17156035 hartree
electener: -2824.48408579 hartree
oneelecener: -5037.88237341 hartree
twoeener: 2213.39828762 hartree
cpcmener: -0.01469973 hartree
kineticenergy: 907.78655352 hartree
xcener: -92.068302801557 hartree
chargesum: 0.0000000
charge: -0.396444 -0.395144 -0.226958 0.082462 0.580671 -0.226203 -0.231984 0.263813 -0.275504 -0.267280 0.141663 0.015469 -0.375138 -0.356847 -0.361455 -0.144059 -0.076759 -0.054428 -0.103325 -0.274592 -0.269084 0.057306 0.088003 0.077789 0.080576 0.087884 0.080219 0.083431 0.080588 0.082553 0.079238 0.072556 0.101923 0.096904 0.095400 0.097834 0.097507 0.093891 0.094762 0.099222 0.094381 0.094513 0.095279 0.087919 0.089054 0.080963 0.081665 0.062471 0.061562 0.061034 0.082355 0.076069 0.093765 0.094073 0.070240 0.078192
qa: -0.3964 -0.3951 -0.2270 0.0825 0.5807 -0.2262 -0.2320 0.2638 -0.2755 -0.2673 0.1417 0.0155 -0.3751 -0.3568 -0.3615 -0.1441 -0.0768 -0.0544 -0.1033 -0.2746 -0.2691 0.0573 0.0880 0.0778 0.0806 0.0879 0.0802 0.0834 0.0806 0.0826 0.0792 0.0726 0.1019 0.0969 0.0954 0.0978 0.0975 0.0939 0.0948 0.0992 0.0944 0.0945 0.0953 0.0879 0.0891 0.0810 0.0817 0.0625 0.0616 0.0610 0.0824 0.0761 0.0938 0.0941 0.0702 0.0782
va: 1.9849 2.0065 2.8389 3.6905 3.7422 3.9241 3.9470 3.6676 4.0605 4.0379 3.8380 3.9878 3.9471 3.9212 3.9255 4.0277 3.8722 3.9251 3.8966 3.9129 3.9048 1.0171 1.0146 1.0182 1.0088 1.0128 1.0203 1.0180 1.0215 1.0181 1.0010 0.9982 0.9946 1.0014 0.9996 1.0048 1.0034 1.0010 1.0065 1.0023 0.9980 1.0073 1.0005 1.0019 1.0029 1.0124 0.9908 0.9936 1.0162 1.0067 0.9983 1.0123 1.0095 1.0067 1.0202 1.0011
dispcorr: -0.029197822 hartree
energy: -912.341723255197
dipole: 2.66504 -2.80926 -0.14422 -16.20426 16.32592 0.12166 -1.94352 1.82174 -0.12178
magnitude: 0.22457 au
magnitude: 0.57081 debye
