program: Orca
programVersion: 5.0.2
elementType: O O N C C C C C C C C C C C C C C C C C C H H H H H H H H H H H H H H H H H H H H H H H H H H H H H H H H H H H
charge: 0
multiplicity: 1
keywords: wb97x-d3
keywords: def2-TZVPP
keywords: def2/J RIJCOSX
keywords: DEFGRID2
keywords: scfconv7
keywords: smallprint printgap noloewdin
keywords: NOSOSCF
formula: C18H35NO2
InChI: InChI=1/C18H35NO2/c1-6-12-19(7-2)13-16-14-20-18(21-16)10-8-15(9-11-18)17(3,4)5/h15-16H,6-14H2,1-5H3
56 atoms
O  -0.707332 1.107347 -0.376679
O  -0.164683 3.107496 0.48823
N  -3.305455 -0.453303 0.107286
C  2.681104 -0.033401 -0.002594
C  0.370331 1.844543 0.171831
C  2.108817 0.674463 -1.234853
C  1.572471 -0.200094 1.042259
C  3.436001 -1.350665 -0.327892
C  1.457672 2.006525 -0.874331
C  0.924101 1.133551 1.404235
C  -1.940769 1.711025 -0.018285
C  -1.518214 2.911257 0.833038
C  2.496164 -2.453728 -0.818576
C  4.493233 -1.094236 -1.406631
C  4.166926 -1.846067 0.923695
C  -2.865353 0.766465 0.741869
C  -2.406124 -1.590831 0.105442
C  -4.073452 -0.299919 -1.112353
C  -1.980431 -2.05227 1.493394
C  -3.308414 -0.26662 -2.435599
C  -1.195592 -3.354355 1.434116
H  3.432295 0.644764 0.429306
H  2.894033 0.872947 -1.965872
H  1.37852 0.031932 -1.73664
H  0.804954 -0.884221 0.667296
H  1.963684 -0.653349 1.954878
H  1.038784 2.481503 -1.765783
H  2.219598 2.685047 -0.478375
H  1.667941 1.786247 1.871991
H  0.131731 0.976401 2.142828
H  -2.435348 2.056183 -0.933206
H  -1.638017 2.708438 1.905794
H  -2.079335 3.816335 0.59855
H  1.793438 -2.771321 -0.046216
H  1.9128 -2.144047 -1.688173
H  3.066125 -3.338615 -1.112562
H  5.136268 -0.248942 -1.147731
H  4.053264 -0.888831 -2.383572
H  5.137025 -1.968804 -1.525697
H  4.758495 -2.736752 0.698684
H  4.852741 -1.087873 1.310668
H  3.483615 -2.114405 1.730691
H  -3.753868 1.356075 1.000922
H  -2.394645 0.515937 1.696206
H  -2.951163 -2.417394 -0.364015
H  -1.505957 -1.445824 -0.509986
H  -4.794866 -1.123654 -1.169623
H  -4.670187 0.611478 -1.017685
H  -2.869734 -2.182805 2.116432
H  -1.365299 -1.292645 1.982957
H  -2.573776 0.536847 -2.486317
H  -2.784538 -1.204946 -2.624775
H  -4.009935 -0.120856 -3.259295
H  -0.293035 -3.250051 0.82829
H  -1.789704 -4.161238 1.000044
H  -0.883363 -3.675279 2.428756
elementType: O N C H
totalener: -912.31017126 hartree
nucrepener: 1972.42156016 hartree
electener: -2884.73173142 hartree
oneelecener: -5158.30798057 hartree
twoeener: 2273.57624915 hartree
cpcmener: -0.01585568 hartree
kineticenergy: 907.78156814 hartree
xcener: -92.073767949530 hartree
chargesum: -0.0000000
charge: -0.405127 -0.386224 -0.215577 0.098844 0.576478 -0.213818 -0.192758 0.275167 -0.275272 -0.295268 0.170950 -0.008188 -0.387889 -0.361225 -0.361761 -0.179114 -0.086235 -0.060350 -0.088955 -0.270097 -0.282563 0.057071 0.086458 0.076275 0.012296 0.096546 0.077565 0.083740 0.087801 0.091703 0.091057 0.077692 0.103541 0.093021 0.100663 0.101141 0.099237 0.094672 0.094699 0.094801 0.096737 0.095438 0.099797 0.095385 0.088320 0.057957 0.077821 0.077861 0.069712 0.056554 0.081305 0.085942 0.096026 0.066588 0.090687 0.092879
qa: -0.4051 -0.3862 -0.2156 0.0988 0.5765 -0.2138 -0.1928 0.2752 -0.2753 -0.2953 0.1709 -0.0082 -0.3879 -0.3612 -0.3618 -0.1791 -0.0862 -0.0604 -0.0890 -0.2701 -0.2826 0.0571 0.0865 0.0763 0.0123 0.0965 0.0776 0.0837 0.0878 0.0917 0.0911 0.0777 0.1035 0.0930 0.1007 0.1011 0.0992 0.0947 0.0947 0.0948 0.0967 0.0954 0.0998 0.0954 0.0883 0.0580 0.0778 0.0779 0.0697 0.0566 0.0813 0.0859 0.0960 0.0666 0.0907 0.0929
va: 1.9647 2.0172 2.8954 3.7071 3.7811 3.9141 3.9882 3.6647 4.0486 4.0168 3.6924 4.0086 3.9616 3.9271 3.9239 4.0277 3.9295 3.9315 3.8322 3.8756 3.9505 1.0173 1.0136 1.0192 1.0283 1.0114 1.0296 1.0168 1.0255 1.0114 0.9892 0.9981 0.9946 0.9870 1.0012 1.0073 1.0021 0.9972 1.0072 1.0061 1.0031 1.0013 1.0029 0.9962 0.9907 0.9852 0.9948 1.0016 1.0222 1.0062 1.0035 0.9978 1.0105 0.9954 1.0034 1.0050
dispcorr: -0.032219617 hartree
energy: -912.342390880639
dipole: 6.49413 -6.70751 -0.21337 -17.45673 17.43704 -0.01969 -1.78379 2.03303 0.24925
magnitude: 0.32869 au
magnitude: 0.83547 debye
