program: Orca
programVersion: 5.0.2
elementType: O O N C C C C C C C C C C C C C C C C C C H H H H H H H H H H H H H H H H H H H H H H H H H H H H H H H H H H H
charge: 0
multiplicity: 1
keywords: wb97x-d3
keywords: def2-TZVPP
keywords: def2/J RIJCOSX
keywords: DEFGRID2
keywords: scfconv7
keywords: smallprint printgap noloewdin
keywords: NOSOSCF
formula: C18H35NO2
InChI: InChI=1/C18H35NO2/c1-6-12-19(7-2)13-16-14-20-18(21-16)10-8-15(9-11-18)17(3,4)5/h15-16H,6-14H2,1-5H3
56 atoms
O  -0.291674 0.610759 0.21825
O  -0.111429 2.863037 0.335055
N  -3.018266 -0.972262 0.414248
C  3.270947 0.301396 -0.136427
C  0.643268 1.674451 0.200255
C  2.280889 0.467972 -1.293992
C  2.493958 0.266032 1.183676
C  4.255977 -0.886172 -0.310071
C  1.395658 1.699858 -1.121449
C  1.615139 1.500888 1.35962
C  -1.610638 1.132593 0.192397
C  -1.406071 2.517677 0.777744
C  3.551325 -2.241326 -0.218652
C  4.961543 -0.7894 -1.666533
C  5.3360 -0.818131 0.773819
C  -2.559587 0.2632 1.00941
C  -4.010132 -0.777668 -0.632568
C  -1.973212 -1.931819 0.101573
C  -5.431022 -0.740419 -0.085304
C  -2.489394 -3.360366 0.057145
C  -6.467188 -0.498209 -1.171304
H  3.89391 1.208359 -0.120124
H  2.810369 0.564851 -2.242956
H  1.652027 -0.423535 -1.383817
H  1.870355 -0.631841 1.228666
H  3.175902 0.206403 2.033878
H  0.683817 1.774356 -1.948882
H  2.016073 2.60121 -1.1541
H  2.247533 2.392604 1.41266
H  1.062293 1.44519 2.302117
H  -1.964126 1.214822 -0.845101
H  -1.470626 2.502837 1.87472
H  -2.122769 3.25016 0.404001
H  4.258622 -3.052175 -0.409242
H  3.12261 -2.418958 0.769243
H  2.746583 -2.33955 -0.950196
H  5.41182 0.195565 -1.815979
H  4.288686 -0.976323 -2.504551
H  5.764697 -1.527166 -1.733758
H  5.865842 0.137664 0.748127
H  4.931925 -0.944199 1.779277
H  6.079071 -1.606151 0.629444
H  -3.440168 0.870062 1.243719
H  -2.078615 0.049006 1.970166
H  -3.819065 0.136858 -1.21378
H  -3.938461 -1.593935 -1.354952
H  -1.45391 -1.707004 -0.842699
H  -1.21614 -1.867678 0.886203
H  -5.512726 0.039262 0.678354
H  -5.635593 -1.688122 0.420303
H  -2.934741 -3.646382 1.011126
H  -3.239527 -3.51162 -0.720861
H  -1.669073 -4.049037 -0.151693
H  -7.478724 -0.491733 -0.762911
H  -6.430506 -1.274618 -1.93858
H  -6.310158 0.461086 -1.66899
elementType: O N C H
totalener: -912.31448877 hartree
nucrepener: 1890.81297442 hartree
electener: -2803.12746319 hartree
oneelecener: -4995.09628842 hartree
twoeener: 2191.96882522 hartree
cpcmener: -0.01590776 hartree
kineticenergy: 907.78768218 hartree
xcener: -92.067940170932 hartree
chargesum: -0.0000000
charge: -0.384631 -0.396481 -0.236906 0.083720 0.556926 -0.223802 -0.231825 0.261361 -0.268685 -0.262813 0.126657 0.015807 -0.373375 -0.361708 -0.356360 -0.132832 -0.076317 -0.033374 -0.063769 -0.269726 -0.283068 0.056218 0.084566 0.077626 0.080360 0.088916 0.080061 0.084027 0.078882 0.081842 0.077063 0.074080 0.100018 0.097941 0.094071 0.097828 0.099901 0.094313 0.094765 0.096287 0.094037 0.094506 0.102015 0.088700 0.075366 0.091163 0.061834 0.074115 0.052913 0.048649 0.071960 0.079989 0.088783 0.090627 0.079267 0.078515
qa: -0.3846 -0.3965 -0.2369 0.0837 0.5569 -0.2238 -0.2318 0.2614 -0.2687 -0.2628 0.1267 0.0158 -0.3734 -0.3617 -0.3564 -0.1328 -0.0763 -0.0334 -0.0638 -0.2697 -0.2831 0.0562 0.0846 0.0776 0.0804 0.0889 0.0801 0.0840 0.0789 0.0818 0.0771 0.0741 0.1000 0.0979 0.0941 0.0978 0.0999 0.0943 0.0948 0.0963 0.0940 0.0945 0.1020 0.0887 0.0754 0.0912 0.0618 0.0741 0.0529 0.0486 0.0720 0.0800 0.0888 0.0906 0.0793 0.0785
va: 1.9850 2.0041 2.8857 3.6921 3.7766 3.9285 3.9432 3.6708 4.0452 4.0446 3.8342 3.9967 3.9463 3.9251 3.9241 4.0214 3.8781 3.9039 3.8636 3.9197 3.9548 1.0171 1.0142 1.0156 1.0120 1.0131 1.0204 1.0174 1.0218 1.0179 1.0059 0.9979 0.9940 1.0049 0.9990 1.0011 1.0020 0.9973 1.0073 1.0035 1.0022 1.0059 0.9928 1.0110 1.0041 0.9973 0.9966 0.9982 1.0129 1.0183 1.0156 1.0027 1.0079 1.0038 1.0001 1.0014
dispcorr: -0.028528200 hartree
energy: -912.343016970962
dipole: 1.20700 -1.44347 -0.23647 -13.79837 13.90007 0.10170 -3.92139 3.77886 -0.14253
magnitude: 0.29424 au
magnitude: 0.74789 debye
