program: Orca
programVersion: 5.0.2
elementType: O O N C C C C C C C C C C C C C C C C C C H H H H H H H H H H H H H H H H H H H H H H H H H H H H H H H H H H H
charge: 0
multiplicity: 1
keywords: wb97x-d3
keywords: def2-TZVPP
keywords: def2/J RIJCOSX
keywords: DEFGRID2
keywords: scfconv7
keywords: smallprint printgap noloewdin
keywords: NOSOSCF
formula: C18H35NO2
InChI: InChI=1/C18H35NO2/c1-6-12-19(7-2)13-16-14-20-18(21-16)10-8-15(9-11-18)17(3,4)5/h15-16H,6-14H2,1-5H3
56 atoms
O  0.051706 -0.200552 -0.2716
O  -0.404529 2.010568 -0.182901
N  -3.536005 -0.342729 0.603203
C  3.561143 0.489123 0.162648
C  0.652504 1.081449 -0.136736
C  2.835483 0.349981 -1.179405
C  2.558663 0.24857 1.295537
C  4.854926 -0.360866 0.270199
C  1.642174 1.296756 -1.276262
C  1.360245 1.189181 1.203882
C  -1.343695 -0.059218 -0.480632
C  -1.477441 1.402637 -0.875199
C  4.587146 -1.853842 0.073413
C  5.861917 0.101614 -0.787332
C  5.502337 -0.152759 1.64324
C  -2.103808 -0.412736 0.795309
C  -4.060624 -1.405964 -0.249308
C  -4.271087 -0.183595 1.845789
C  -4.662946 -0.892626 -1.551692
C  -5.700798 0.281963 1.635339
C  -5.244588 -2.012431 -2.400135
H  3.88526 1.537514 0.245624
H  3.510984 0.561129 -2.010326
H  2.493942 -0.680475 -1.317085
H  2.211932 -0.789478 1.280454
H  3.029578 0.398546 2.268189
H  1.136873 1.175252 -2.239178
H  1.99586 2.331655 -1.231238
H  1.70004 2.221558 1.334391
H  0.650237 0.983019 2.009947
H  -1.639428 -0.723299 -1.298208
H  -2.415121 1.851879 -0.548042
H  -1.390738 1.537899 -1.960115
H  4.217596 -2.077877 -0.928927
H  5.507023 -2.427626 0.210943
H  3.858368 -2.241197 0.788225
H  5.52027 -0.089705 -1.805608
H  6.813801 -0.420977 -0.667893
H  6.065036 1.172447 -0.702829
H  4.920407 -0.596312 2.452611
H  6.492327 -0.613664 1.674516
H  5.629812 0.909263 1.869796
H  -1.822381 0.30358 1.572886
H  -1.767465 -1.403409 1.14447
H  -3.269368 -2.129173 -0.481259
H  -4.820306 -1.983727 0.291332
H  -4.277779 -1.110503 2.443368
H  -3.751836 0.564594 2.449525
H  -3.895243 -0.357144 -2.118873
H  -5.440524 -0.158203 -1.325218
H  -6.299746 -0.441747 1.080132
H  -6.189738 0.431598 2.599418
H  -5.728971 1.229761 1.095202
H  -6.043057 -2.538542 -1.872435
H  -4.484769 -2.751458 -2.663194
H  -5.665436 -1.631568 -3.33158
elementType: O N C H
totalener: -912.31443110 hartree
nucrepener: 1868.53338867 hartree
electener: -2780.84781978 hartree
oneelecener: -4950.53471080 hartree
twoeener: 2169.68689102 hartree
cpcmener: -0.01482547 hartree
kineticenergy: 907.79063319 hartree
xcener: -92.066446059419 hartree
chargesum: -0.0000000
charge: -0.430872 -0.402939 -0.239097 0.085175 0.564355 -0.228469 -0.219307 0.260564 -0.275048 -0.277142 0.229454 0.005967 -0.372598 -0.356714 -0.360510 -0.175127 -0.093737 -0.051745 -0.077782 -0.265362 -0.282250 0.055923 0.088054 0.078320 0.077721 0.085556 0.082014 0.079365 0.086762 0.085237 0.094694 0.089239 0.084895 0.094276 0.097291 0.097861 0.094193 0.094498 0.097057 0.093603 0.094942 0.099357 0.094296 0.080082 0.089025 0.087886 0.063236 0.077140 0.058785 0.060868 0.081543 0.093289 0.075750 0.079828 0.079705 0.090894
qa: -0.4309 -0.4029 -0.2391 0.0852 0.5644 -0.2285 -0.2193 0.2606 -0.2750 -0.2771 0.2295 0.0060 -0.3726 -0.3567 -0.3605 -0.1751 -0.0937 -0.0517 -0.0778 -0.2654 -0.2822 0.0559 0.0881 0.0783 0.0777 0.0856 0.0820 0.0794 0.0868 0.0852 0.0947 0.0892 0.0849 0.0943 0.0973 0.0979 0.0942 0.0945 0.0971 0.0936 0.0949 0.0994 0.0943 0.0801 0.0890 0.0879 0.0632 0.0771 0.0588 0.0609 0.0815 0.0933 0.0757 0.0798 0.0797 0.0909
va: 1.9884 1.9998 2.8325 3.6854 3.7992 3.9281 3.9211 3.6674 4.0735 4.0375 3.8021 3.9320 3.9460 3.9238 3.9258 3.9737 3.8445 3.9161 3.8570 3.9125 3.9514 1.0171 1.0132 1.0208 1.0207 1.0140 1.0149 1.0212 1.0179 1.0168 0.9971 1.0261 0.9954 0.9996 1.0045 1.0010 1.0014 1.0063 1.0033 0.9980 1.0073 1.0023 1.0059 1.0180 1.0021 0.9984 1.0021 0.9970 1.0132 1.0112 0.9977 1.0101 1.0109 1.0010 1.0011 1.0036
dispcorr: -0.028410615 hartree
energy: -912.342841717389
dipole: 0.64082 -1.00880 -0.36798 -8.03794 7.66132 -0.37662 0.13704 -0.20717 -0.07013
magnitude: 0.53120 au
magnitude: 1.35020 debye
