program: Orca
programVersion: 5.0.2
elementType: O O N C C C C C C C C C C C C C C C C C C H H H H H H H H H H H H H H H H H H H H H H H H H H H H H H H H H H H
charge: 0
multiplicity: 1
keywords: wb97x-d3
keywords: def2-TZVPP
keywords: def2/J RIJCOSX
keywords: DEFGRID2
keywords: scfconv7
keywords: smallprint printgap noloewdin
keywords: NOSOSCF
formula: C18H35NO2
InChI: InChI=1/C18H35NO2/c1-6-12-19(7-2)13-16-14-20-18(21-16)10-8-15(9-11-18)17(3,4)5/h15-16H,6-14H2,1-5H3
56 atoms
O  0.047781 -0.177599 -0.253366
O  -0.387661 2.036878 -0.166702
N  -3.546373 -0.326516 0.593786
C  3.5687 0.485519 0.163584
C  0.661367 1.09831 -0.124127
C  2.835855 0.349627 -1.17504
C  2.568991 0.254257 1.300915
C  4.856349 -0.374731 0.267628
C  1.6481 1.304239 -1.268514
C  1.376382 1.202791 1.213123
C  -1.345384 -0.025088 -0.470788
C  -1.467263 1.44016 -0.857987
C  4.573636 -1.86778 0.092975
C  5.857286 0.064291 -0.80563
C  5.520346 -0.154611 1.630865
C  -2.114518 -0.382648 0.798481
C  -4.050677 -1.394454 -0.266295
C  -4.286258 -0.193069 1.83758
C  -4.671668 -0.88103 -1.55964
C  -5.733484 0.217214 1.631536
C  -5.234254 -2.004088 -2.416744
H  3.901214 1.531532 0.242692
H  3.508476 0.55499 -2.009706
H  2.486979 -0.678817 -1.309321
H  2.215038 -0.781292 1.287642
H  3.044563 0.401358 2.27173
H  1.138683 1.184327 -2.229452
H  2.009337 2.336635 -1.227025
H  1.723736 2.233033 1.340466
H  0.668831 1.002352 2.022767
H  -1.640933 -0.681656 -1.294442
H  -2.400796 1.894827 -0.525846
H  -1.383446 1.580667 -1.942367
H  3.856063 -2.241866 0.825869
H  4.183286 -2.100253 -0.899506
H  5.4916 -2.447077 0.219557
H  6.066506 1.13541 -0.742181
H  5.507358 -0.144074 -1.817731
H  6.807407 -0.460988 -0.683459
H  5.669177 0.908498 1.837939
H  4.93941 -0.573928 2.453603
H  6.50229 -0.63242 1.66053
H  -1.84686 0.338071 1.577119
H  -1.773474 -1.369475 1.153628
H  -3.243788 -2.095512 -0.510525
H  -4.792259 -1.99694 0.272538
H  -4.255713 -1.118918 2.436145
H  -3.794138 0.575157 2.438992
H  -3.918737 -0.32252 -2.124547
H  -5.463826 -0.166159 -1.321429
H  -5.801773 1.162206 1.090386
H  -6.307606 -0.529725 1.081068
H  -6.223127 0.349341 2.5976
H  -6.022131 -2.54916 -1.892325
H  -4.462112 -2.727183 -2.688146
H  -5.664055 -1.622764 -3.343917
elementType: O N C H
totalener: -912.31458511 hartree
nucrepener: 1867.19654034 hartree
electener: -2779.51112545 hartree
oneelecener: -4947.86100073 hartree
twoeener: 2168.34987527 hartree
cpcmener: -0.01491262 hartree
kineticenergy: 907.78420022 hartree
xcener: -92.065060459985 hartree
chargesum: -0.0000000
charge: -0.430105 -0.402218 -0.240090 0.085764 0.563727 -0.229114 -0.220306 0.260657 -0.274226 -0.276077 0.226853 0.006202 -0.372840 -0.357553 -0.360452 -0.173332 -0.092881 -0.053661 -0.079586 -0.265220 -0.282725 0.056069 0.088038 0.078310 0.077897 0.085942 0.082155 0.079393 0.086627 0.085266 0.093954 0.088924 0.084797 0.097719 0.094539 0.097189 0.097432 0.094164 0.094578 0.099376 0.093743 0.094987 0.094019 0.080525 0.089273 0.088518 0.063319 0.077868 0.059197 0.061303 0.075970 0.081802 0.093553 0.080153 0.079686 0.090901
qa: -0.4301 -0.4022 -0.2401 0.0858 0.5637 -0.2291 -0.2203 0.2607 -0.2742 -0.2761 0.2269 0.0062 -0.3728 -0.3576 -0.3605 -0.1733 -0.0929 -0.0537 -0.0796 -0.2652 -0.2827 0.0561 0.0880 0.0783 0.0779 0.0859 0.0822 0.0794 0.0866 0.0853 0.0940 0.0889 0.0848 0.0977 0.0945 0.0972 0.0974 0.0942 0.0946 0.0994 0.0937 0.0950 0.0940 0.0805 0.0893 0.0885 0.0633 0.0779 0.0592 0.0613 0.0760 0.0818 0.0936 0.0802 0.0797 0.0909
va: 1.9880 2.0003 2.8313 3.6847 3.8011 3.9287 3.9221 3.6687 4.0722 4.0383 3.8051 3.9339 3.9459 3.9239 3.9249 3.9719 3.8436 3.9183 3.8589 3.9120 3.9509 1.0171 1.0130 1.0208 1.0205 1.0140 1.0146 1.0213 1.0180 1.0170 0.9980 1.0254 0.9953 1.0009 0.9997 1.0045 1.0032 1.0011 1.0064 1.0024 0.9983 1.0072 1.0060 1.0182 1.0019 0.9982 1.0021 0.9964 1.0130 1.0110 1.0107 0.9979 1.0099 1.0009 1.0011 1.0036
dispcorr: -0.028352453 hartree
energy: -912.342937566764
dipole: 0.60811 -0.97087 -0.36276 -8.27066 7.88847 -0.38220 0.03670 -0.11570 -0.07900
magnitude: 0.53283 au
magnitude: 1.35436 debye
