program: Orca
programVersion: 5.0.2
elementType: O O N C C C C C C C C C C C C C C C C C C H H H H H H H H H H H H H H H H H H H H H H H H H H H H H H H H H H H
charge: 0
multiplicity: 1
keywords: wb97x-d3
keywords: def2-TZVPP
keywords: def2/J RIJCOSX
keywords: DEFGRID2
keywords: scfconv7
keywords: smallprint printgap noloewdin
keywords: NOSOSCF
formula: C18H35NO2
InChI: InChI=1/C18H35NO2/c1-6-12-19(7-2)13-16-14-20-18(21-16)10-8-15(9-11-18)17(3,4)5/h15-16H,6-14H2,1-5H3
56 atoms
O  -0.442506 0.94235 0.245558
O  -0.070593 3.142856 -0.080046
N  -3.254795 -0.432185 -0.004643
C  3.005813 0.157474 -0.084958
C  0.576405 1.882303 -0.00426
C  2.015966 0.234611 -1.252325
C  2.289094 0.504307 1.224551
C  3.790895 -1.181156 -0.023787
C  1.289062 1.575831 -1.315275
C  1.563198 1.844711 1.148952
C  -1.666068 1.478081 -0.226684
C  -1.46532 2.958486 0.058071
C  4.56167 -1.391958 -1.330458
C  4.815909 -1.127609 1.113402
C  2.871969 -2.384399 0.201159
C  -2.860391 0.874868 0.487524
C  -2.401464 -1.513444 0.476007
C  -4.658824 -0.712622 0.267798
C  -2.315457 -2.680312 -0.499259
C  -5.622012 0.059366 -0.61743
C  -1.424711 -3.795175 0.027825
H  3.759112 0.941712 -0.253481
H  2.5318 0.080872 -2.20188
H  1.278245 -0.569792 -1.17481
H  1.571518 -0.280013 1.483013
H  3.000851 0.549466 2.05054
H  0.572802 1.57765 -2.142708
H  2.006292 2.377007 -1.519897
H  2.291136 2.649415 1.007702
H  1.039493 2.048801 2.087442
H  -1.775754 1.307682 -1.306393
H  -1.797768 3.218298 1.071813
H  -1.996931 3.597263 -0.649856
H  5.214259 -2.265007 -1.255752
H  3.903037 -1.560531 -2.183641
H  5.193895 -0.531639 -1.565825
H  4.349225 -1.109244 2.099337
H  5.456675 -0.245267 1.034628
H  5.466192 -2.005253 1.087326
H  2.306513 -2.304704 1.131365
H  2.155708 -2.515152 -0.612331
H  3.4578 -3.3048 0.261988
H  -3.689081 1.566497 0.317895
H  -2.675122 0.886514 1.574842
H  -1.392363 -1.133747 0.628728
H  -2.734876 -1.877268 1.462775
H  -4.827996 -1.777471 0.098378
H  -4.906317 -0.535634 1.327918
H  -1.923573 -2.312403 -1.451551
H  -3.311071 -3.081433 -0.7099
H  -5.425564 -0.135072 -1.672809
H  -6.647794 -0.246936 -0.406161
H  -5.574188 1.137976 -0.460541
H  -1.352363 -4.617675 -0.685039
H  -1.807632 -4.20783 0.963663
H  -0.40966 -3.438437 0.218413
elementType: O N C H
totalener: -912.31553643 hartree
nucrepener: 1918.64013782 hartree
electener: -2830.95567425 hartree
oneelecener: -5050.85982222 hartree
twoeener: 2219.90414797 hartree
cpcmener: -0.01514967 hartree
kineticenergy: 907.78738748 hartree
xcener: -92.065820957763 hartree
chargesum: 0.0000000
charge: -0.388867 -0.406099 -0.241459 0.097125 0.564381 -0.237825 -0.233097 0.262546 -0.266334 -0.251840 0.156841 0.024901 -0.360004 -0.357953 -0.383771 -0.136649 -0.085330 -0.050417 -0.072633 -0.258627 -0.274439 0.057603 0.086702 0.077525 0.078516 0.089162 0.083545 0.086525 0.080435 0.079489 0.048643 0.072302 0.093548 0.095149 0.094447 0.098506 0.094344 0.098288 0.094636 0.096573 0.092519 0.100792 0.114329 0.078443 0.086200 0.076087 0.089455 0.066912 0.046617 0.059880 0.073119 0.089730 0.077605 0.092077 0.081744 0.068106
qa: -0.3889 -0.4061 -0.2415 0.0971 0.5644 -0.2378 -0.2331 0.2625 -0.2663 -0.2518 0.1568 0.0249 -0.3600 -0.3580 -0.3838 -0.1366 -0.0853 -0.0504 -0.0726 -0.2586 -0.2744 0.0576 0.0867 0.0775 0.0785 0.0892 0.0835 0.0865 0.0804 0.0795 0.0486 0.0723 0.0935 0.0951 0.0944 0.0985 0.0943 0.0983 0.0946 0.0966 0.0925 0.1008 0.1143 0.0784 0.0862 0.0761 0.0895 0.0669 0.0466 0.0599 0.0731 0.0897 0.0776 0.0921 0.0817 0.0681
va: 1.9963 1.9968 2.8379 3.6823 3.7628 3.9536 3.9377 3.6791 4.0371 4.0486 3.9149 3.9919 3.9224 3.9229 3.9492 3.9314 3.8955 3.8814 3.8504 3.9293 3.9565 1.0167 1.0141 1.0101 1.0129 1.0119 1.0139 1.0189 1.0192 1.0241 1.0303 0.9967 0.9933 1.0070 0.9992 1.0028 0.9985 1.0030 1.0075 0.9990 0.9971 1.0058 0.9891 1.0239 1.0086 1.0071 0.9871 1.0067 1.0199 1.0138 1.0140 1.0070 1.0046 1.0041 1.0025 0.9987
dispcorr: -0.029050880 hartree
energy: -912.344587313067
dipole: 2.85880 -3.38154 -0.52274 -17.20436 17.05258 -0.15178 -0.10470 0.25306 0.14836
magnitude: 0.56419 au
magnitude: 1.43405 debye
