program: Orca
programVersion: 5.0.2
elementType: O O N C C C C C C C C C C C C C C C C C C H H H H H H H H H H H H H H H H H H H H H H H H H H H H H H H H H H H
charge: 0
multiplicity: 1
keywords: wb97x-d3
keywords: def2-TZVPP
keywords: def2/J RIJCOSX
keywords: DEFGRID2
keywords: scfconv7
keywords: smallprint printgap noloewdin
keywords: NOSOSCF
formula: C18H35NO2
InChI: InChI=1/C18H35NO2/c1-6-12-19(7-2)13-16-14-20-18(21-16)10-8-15(9-11-18)17(3,4)5/h15-16H,6-14H2,1-5H3
56 atoms
O  -0.567634 0.750373 -0.364243
O  -0.398838 2.632842 0.870227
N  -3.500184 -0.493928 -0.07757
C  2.903673 0.015816 0.212101
C  0.343931 1.539828 0.386823
C  2.340094 0.80143 -0.976453
C  1.746094 -0.424366 1.114472
C  3.852132 -1.145614 -0.18807
C  1.485217 1.982387 -0.521388
C  0.891281 0.753773 1.56738
C  -1.830464 1.400918 -0.44668
C  -1.496128 2.819559 0.003467
C  4.556207 -1.687044 1.059985
C  3.104154 -2.294459 -0.86831
C  4.936378 -0.632754 -1.141416
C  -2.890224 0.722366 0.427043
C  -2.60512 -1.62831 -0.244238
C  -4.306162 -0.304074 -1.274269
C  -1.922497 -2.095709 1.03217
C  -5.394511 0.746606 -1.140725
C  -1.064871 -3.326357 0.776762
H  3.517051 0.721429 0.792348
H  3.147826 1.189529 -1.598558
H  1.747642 0.14292 -1.619498
H  1.115223 -1.145181 0.585503
H  2.118363 -0.941499 2.000883
H  1.089508 2.520259 -1.388248
H  2.111474 2.689152 0.0324
H  1.495416 1.429447 2.181235
H  0.064098 0.408228 2.194078
H  -2.151259 1.39961 -1.49316
H  -2.303589 3.30532 0.553902
H  -1.236043 3.458509 -0.848972
H  3.862068 -2.129221 1.776127
H  5.273511 -2.4658 0.790686
H  5.108901 -0.899404 1.578726
H  2.541759 -1.960491 -1.742704
H  2.402701 -2.788791 -0.193452
H  3.807497 -3.057328 -1.210884
H  4.541374 -0.37586 -2.125242
H  5.435204 0.254293 -0.742066
H  5.703617 -1.395154 -1.295549
H  -3.691046 1.445286 0.598416
H  -2.466388 0.52912 1.416509
H  -3.213753 -2.458891 -0.616548
H  -1.842199 -1.456259 -1.020702
H  -3.696218 -0.076177 -2.163846
H  -4.785737 -1.262947 -1.488969
H  -2.681381 -2.320716 1.786774
H  -1.293731 -1.307629 1.450015
H  -6.000777 0.579406 -0.248958
H  -5.005277 1.764482 -1.100737
H  -6.057447 0.694427 -2.005415
H  -0.563508 -3.657134 1.687339
H  -0.289859 -3.125264 0.033705
H  -1.661875 -4.163161 0.408121
elementType: O N C H
totalener: -912.31220791 hartree
nucrepener: 1951.37888389 hartree
electener: -2863.69109180 hartree
oneelecener: -5116.26659833 hartree
twoeener: 2252.57550653 hartree
cpcmener: -0.01605939 hartree
kineticenergy: 907.78323098 hartree
xcener: -92.071456960881 hartree
chargesum: 0.0000000
charge: -0.407058 -0.396411 -0.190159 0.101698 0.576504 -0.226248 -0.220736 0.272823 -0.278265 -0.294755 0.195798 -0.003882 -0.358943 -0.381316 -0.359149 -0.237592 -0.100318 -0.072347 -0.077401 -0.267337 -0.297207 0.057119 0.086163 0.075835 0.044706 0.094749 0.081877 0.078897 0.096640 0.090502 0.104052 0.092810 0.085419 0.095035 0.094369 0.095979 0.101393 0.087299 0.100233 0.093976 0.099433 0.094418 0.103147 0.118382 0.091783 0.064148 0.066021 0.084763 0.069622 0.050938 0.080672 0.082332 0.094558 0.097322 0.074030 0.093682
qa: -0.4071 -0.3964 -0.1902 0.1017 0.5765 -0.2262 -0.2207 0.2728 -0.2783 -0.2948 0.1958 -0.0039 -0.3589 -0.3813 -0.3591 -0.2376 -0.1003 -0.0723 -0.0774 -0.2673 -0.2972 0.0571 0.0862 0.0758 0.0447 0.0947 0.0819 0.0789 0.0966 0.0905 0.1041 0.0928 0.0854 0.0950 0.0944 0.0960 0.1014 0.0873 0.1002 0.0940 0.0994 0.0944 0.1031 0.1184 0.0918 0.0641 0.0660 0.0848 0.0696 0.0509 0.0807 0.0823 0.0946 0.0973 0.0740 0.0937
va: 1.9665 2.0045 2.9329 3.6914 3.8122 3.9266 3.9561 3.6606 4.0509 4.0173 3.6797 4.0228 3.9228 3.9525 3.9271 4.0270 3.9220 3.9224 3.8134 3.9052 3.9468 1.0167 1.0126 1.0225 1.0176 1.0135 1.0149 1.0216 1.0197 1.0167 0.9962 0.9966 0.9941 1.0018 1.0058 1.0034 1.0005 0.9984 1.0067 0.9969 1.0018 1.0077 0.9985 0.9993 0.9974 1.0056 0.9950 0.9932 1.0240 1.0161 1.0121 0.9978 1.0061 1.0026 0.9968 1.0026
dispcorr: -0.031361093 hartree
energy: -912.343569006382
dipole: 6.00117 -6.09667 -0.09550 -13.46322 13.78589 0.32266 -2.98439 2.41711 -0.56728
magnitude: 0.65957 au
magnitude: 1.67650 debye
