program: Orca
programVersion: 5.0.2
elementType: O O N C C C C C C C C C C C C C C C C C C H H H H H H H H H H H H H H H H H H H H H H H H H H H H H H H H H H H
charge: 0
multiplicity: 1
keywords: wb97x-d3
keywords: def2-TZVPP
keywords: def2/J RIJCOSX
keywords: DEFGRID2
keywords: scfconv7
keywords: smallprint printgap noloewdin
keywords: NOSOSCF
formula: C18H35NO2
InChI: InChI=1/C18H35NO2/c1-6-12-19(7-2)13-16-14-20-18(21-16)10-8-15(9-11-18)17(3,4)5/h15-16H,6-14H2,1-5H3
56 atoms
O  -0.354046 0.744449 -0.415714
O  -0.183415 2.611722 0.847047
N  -2.992606 -0.781297 0.351878
C  3.204862 0.192031 -0.058319
C  0.570488 1.55586 0.295374
C  2.524697 0.953574 -1.199652
C  2.127428 -0.33902 0.892214
C  4.209228 -0.894965 -0.525795
C  1.627147 2.07133 -0.673645
C  1.226925 0.772147 1.421712
C  -1.669962 1.256447 -0.262138
C  -1.391435 2.703376 0.122089
C  3.510999 -2.071043 -1.210987
C  5.223518 -0.290243 -1.501788
C  4.99154 -1.421342 0.681082
C  -2.513076 0.520975 0.776171
C  -4.218825 -1.144499 1.049175
C  -1.993091 -1.83682 0.443235
C  -5.467257 -0.466067 0.50109
C  -2.259591 -2.973459 -0.527631
C  -5.740046 -0.798204 -0.956244
H  3.798177 0.929177 0.503131
H  3.267612 1.401038 -1.86171
H  1.938011 0.266461 -1.817358
H  1.51553 -1.086607 0.378365
H  2.576492 -0.850133 1.745628
H  1.148178 2.599385 -1.503646
H  2.243283 2.804952 -0.144204
H  1.820611 1.466857 2.024174
H  0.457527 0.35838 2.079763
H  -2.177312 1.190287 -1.228968
H  -2.156157 3.146004 0.761729
H  -1.283876 3.335082 -0.767797
H  2.907309 -1.753224 -2.06327
H  4.247899 -2.784221 -1.587985
H  2.857593 -2.618214 -0.529396
H  4.7773 -0.028495 -2.46208
H  6.026703 -1.001455 -1.707494
H  5.685522 0.612434 -1.093627
H  5.505241 -0.612292 1.206447
H  4.354386 -1.931556 1.404686
H  5.751587 -2.13935 0.3643
H  -3.38741 1.154081 0.942029
H  -1.983481 0.481872 1.74282
H  -4.361124 -2.22358 0.958301
H  -4.135623 -0.945456 2.130138
H  -1.017111 -1.417554 0.210615
H  -1.915844 -2.231189 1.46936
H  -5.405879 0.618497 0.628564
H  -6.31259 -0.786955 1.11568
H  -3.208988 -3.477768 -0.341096
H  -2.271938 -2.608188 -1.555184
H  -1.476142 -3.7285 -0.450822
H  -4.942041 -0.442239 -1.60695
H  -6.669828 -0.34134 -1.29748
H  -5.830916 -1.876061 -1.106723
elementType: O N C H
totalener: -912.31257618 hartree
nucrepener: 1910.40691055 hartree
electener: -2822.71948673 hartree
oneelecener: -5034.41174405 hartree
twoeener: 2211.69225732 hartree
cpcmener: -0.01493396 hartree
kineticenergy: 907.81036925 hartree
xcener: -92.071331968970 hartree
chargesum: 0.0000000
charge: -0.423583 -0.401197 -0.228161 0.096149 0.576625 -0.224264 -0.252656 0.266643 -0.273030 -0.286062 0.244135 -0.009484 -0.379633 -0.358082 -0.357779 -0.224793 -0.103867 -0.029436 -0.085167 -0.270581 -0.279326 0.056442 0.085916 0.077237 0.094709 0.088755 0.081212 0.078544 0.091089 0.084882 0.083423 0.092380 0.087416 0.100030 0.097969 0.093267 0.093721 0.094840 0.099146 0.096163 0.095239 0.094142 0.100105 0.104245 0.100183 0.084784 0.061664 0.068379 0.057037 0.069334 0.081005 0.073046 0.092365 0.071604 0.094215 0.079062
qa: -0.4236 -0.4012 -0.2282 0.0961 0.5766 -0.2243 -0.2527 0.2666 -0.2730 -0.2861 0.2441 -0.0095 -0.3796 -0.3581 -0.3578 -0.2248 -0.1039 -0.0294 -0.0852 -0.2706 -0.2793 0.0564 0.0859 0.0772 0.0947 0.0888 0.0812 0.0785 0.0911 0.0849 0.0834 0.0924 0.0874 0.1000 0.0980 0.0933 0.0937 0.0948 0.0991 0.0962 0.0952 0.0941 0.1001 0.1042 0.1002 0.0848 0.0617 0.0684 0.0570 0.0693 0.0810 0.0730 0.0924 0.0716 0.0942 0.0791
va: 1.9798 1.9967 2.8092 3.6696 3.7966 3.9234 3.9659 3.6656 4.0566 4.0062 3.7816 4.0232 3.9491 3.9242 3.9234 4.0066 3.8940 3.8848 3.8469 3.9264 3.9206 1.0169 1.0118 1.0215 0.9873 1.0156 1.0173 1.0212 1.0200 1.0219 1.0134 0.9959 0.9949 1.0011 1.0054 0.9995 0.9975 1.0074 1.0020 1.0035 1.0013 1.0060 1.0008 1.0082 0.9874 1.0129 1.0119 1.0074 1.0110 1.0131 1.0041 1.0119 1.0105 1.0211 1.0062 1.0007
dispcorr: -0.029569367 hartree
energy: -912.342145551551
dipole: 2.23407 -2.50862 -0.27455 -13.75060 13.86870 0.11810 -3.18536 3.41663 0.23128
magnitude: 0.37791 au
magnitude: 0.96057 debye
