program: Orca
programVersion: 5.0.2
elementType: O O N C C C C C C C C C C C C C C C C C C H H H H H H H H H H H H H H H H H H H H H H H H H H H H H H H H H H H
charge: 0
multiplicity: 1
keywords: wb97x-d3
keywords: def2-TZVPP
keywords: def2/J RIJCOSX
keywords: DEFGRID2
keywords: scfconv7
keywords: smallprint printgap noloewdin
keywords: NOSOSCF
formula: C18H35NO2
InChI: InChI=1/C18H35NO2/c1-6-12-19(7-2)13-16-14-20-18(21-16)10-8-15(9-11-18)17(3,4)5/h15-16H,6-14H2,1-5H3
56 atoms
O  -0.369749 0.698952 -0.342283
O  -0.208277 2.733213 0.623164
N  -2.924923 -0.743184 0.615546
C  3.206886 0.272744 -0.036826
C  0.555522 1.626414 0.2031
C  2.465359 0.839973 -1.251408
C  2.177691 -0.132494 1.023516
C  4.22878 -0.842545 -0.384116
C  1.569897 2.014301 -0.866963
C  1.263938 1.027563 1.40772
C  -1.676964 1.254399 -0.34795
C  -1.406768 2.737385 -0.122984
C  5.291641 -0.289892 -1.340134
C  4.948249 -1.302194 0.888159
C  3.565104 -2.056054 -1.037126
C  -2.56736 0.649864 0.739199
C  -3.865651 -1.030936 -0.455881
C  -1.861346 -1.712204 0.792279
C  -5.300715 -1.158254 0.040753
C  -2.376894 -3.046242 1.306623
C  -6.293065 -1.371092 -1.09152
H  3.798267 1.096294 0.390695
H  3.169147 1.180209 -2.012708
H  1.858881 0.059315 -1.720528
H  1.572926 -0.969864 0.661408
H  2.673079 -0.484494 1.929752
H  1.052644 2.402146 -1.749797
H  2.188099 2.829201 -0.476999
H  1.859305 1.813463 1.882976
H  0.521923 0.701848 2.142565
H  -2.119757 1.082238 -1.333968
H  -2.183533 3.236957 0.459171
H  -1.294472 3.276911 -1.07082
H  4.883785 -0.034335 -2.319019
H  5.766185 0.607821 -0.935102
H  6.080045 -1.027391 -1.507494
H  5.373705 -0.458003 1.437165
H  5.770501 -1.97794 0.641484
H  4.289853 -1.841262 1.570591
H  4.306585 -2.83222 -1.241357
H  2.801979 -2.503766 -0.397585
H  3.09386 -1.806306 -1.98951
H  -3.495358 1.232067 0.755991
H  -2.095589 0.812796 1.714916
H  -3.828942 -0.257712 -1.234438
H  -3.578989 -1.956434 -0.964744
H  -1.282672 -1.886719 -0.126718
H  -1.157008 -1.308498 1.523308
H  -5.569378 -0.256106 0.598797
H  -5.359912 -1.987425 0.751274
H  -2.884421 -2.929766 2.265177
H  -3.075232 -3.516024 0.611545
H  -1.547957 -3.742242 1.44631
H  -6.061477 -2.271676 -1.664607
H  -6.290121 -0.530868 -1.789162
H  -7.311409 -1.478021 -0.715444
elementType: O N C H
totalener: -912.31186307 hartree
nucrepener: 1901.95666477 hartree
electener: -2814.26852784 hartree
oneelecener: -5017.48017999 hartree
twoeener: 2203.21165215 hartree
cpcmener: -0.01574644 hartree
kineticenergy: 907.79005650 hartree
xcener: -92.069230931392 hartree
chargesum: -0.0000000
charge: -0.414676 -0.396223 -0.234130 0.096151 0.584128 -0.230783 -0.233043 0.263926 -0.276943 -0.298427 0.198029 -0.008387 -0.357362 -0.361847 -0.375861 -0.188649 -0.065268 -0.035096 -0.067073 -0.270659 -0.283429 0.057240 0.088402 0.077631 0.081963 0.087589 0.082005 0.078442 0.093284 0.085570 0.095050 0.093890 0.086590 0.093746 0.098529 0.094767 0.099312 0.094732 0.094045 0.097780 0.095707 0.096184 0.089684 0.106602 0.077273 0.085713 0.055571 0.072956 0.051660 0.052372 0.072253 0.081297 0.089958 0.078527 0.078696 0.090600
qa: -0.4147 -0.3962 -0.2341 0.0962 0.5841 -0.2308 -0.2330 0.2639 -0.2769 -0.2984 0.1980 -0.0084 -0.3574 -0.3618 -0.3759 -0.1886 -0.0653 -0.0351 -0.0671 -0.2707 -0.2834 0.0572 0.0884 0.0776 0.0820 0.0876 0.0820 0.0784 0.0933 0.0856 0.0950 0.0939 0.0866 0.0937 0.0985 0.0948 0.0993 0.0947 0.0940 0.0978 0.0957 0.0962 0.0897 0.1066 0.0773 0.0857 0.0556 0.0730 0.0517 0.0524 0.0723 0.0813 0.0900 0.0785 0.0787 0.0906
va: 1.9758 2.0038 2.8722 3.6707 3.7859 3.9336 3.9402 3.6687 4.0577 4.0115 3.7154 4.0156 3.9220 3.9246 3.9466 4.0480 3.8543 3.9296 3.8779 3.9129 3.9510 1.0170 1.0124 1.0219 1.0055 1.0146 1.0149 1.0216 1.0198 1.0199 1.0025 0.9954 0.9947 1.0007 1.0027 1.0067 1.0026 1.0071 0.9984 1.0047 1.0018 0.9996 0.9996 1.0000 1.0013 0.9986 0.9977 0.9956 1.0127 1.0133 1.0153 0.9993 1.0102 1.0005 1.0016 1.0037
dispcorr: -0.029362678 hartree
energy: -912.341225745274
dipole: 1.90715 -2.06129 -0.15414 -14.52911 14.73088 0.20177 -2.77318 2.23728 -0.53591
magnitude: 0.59301 au
magnitude: 1.50732 debye
