program: Orca
programVersion: 5.0.2
elementType: O O N C C C C C C C C C C C C C C C C C C H H H H H H H H H H H H H H H H H H H H H H H H H H H H H H H H H H H
charge: 0
multiplicity: 1
keywords: wb97x-d3
keywords: def2-TZVPP
keywords: def2/J RIJCOSX
keywords: DEFGRID2
keywords: scfconv7
keywords: smallprint printgap noloewdin
keywords: NOSOSCF
formula: C18H35NO2
InChI: InChI=1/C18H35NO2/c1-6-12-19(7-2)13-16-14-20-18(21-16)10-8-15(9-11-18)17(3,4)5/h15-16H,6-14H2,1-5H3
56 atoms
O  -0.013204 0.297987 -0.724125
O  -0.257286 2.370761 0.092507
N  -3.388099 -0.571628 0.487072
C  3.470205 0.293261 0.195426
C  0.689049 1.344081 -0.073292
C  2.898387 0.766069 -1.144994
C  2.323629 -0.201092 1.082561
C  4.641143 -0.715698 0.054987
C  1.815109 1.827088 -0.968439
C  1.24722 0.865006 1.265307
C  -1.404309 0.446366 -0.484365
C  -1.5018 1.742792 0.324184
C  4.217857 -2.005881 -0.650411
C  5.784568 -0.073905 -0.737933
C  5.187487 -1.071223 1.441547
C  -1.972825 -0.758614 0.248407
C  -4.235009 -0.751241 -0.685318
C  -3.883354 -1.240706 1.67623
C  -5.16428 0.431878 -0.920143
C  -3.738897 -2.759463 1.703419
C  -6.096746 0.210371 -2.100319
H  3.89612 1.178378 0.691665
H  3.684928 1.186984 -1.773437
H  2.487582 -0.083282 -1.698887
H  1.873713 -1.101898 0.653769
H  2.692508 -0.484271 2.069624
H  1.408148 2.122686 -1.939427
H  2.253558 2.722915 -0.517959
H  1.67463 1.727539 1.786714
H  0.445351 0.48003 1.902234
H  -1.902524 0.562188 -1.454203
H  -1.663334 1.543341 1.390753
H  -2.297195 2.405059 -0.017384
H  5.064086 -2.693357 -0.723761
H  3.425739 -2.530882 -0.113024
H  3.863786 -1.826167 -1.667197
H  6.085617 0.882201 -0.3017
H  5.523946 0.107282 -1.7817
H  6.663125 -0.723317 -0.739062
H  6.091649 -1.678085 1.353601
H  5.449995 -0.175358 2.010391
H  4.477839 -1.645711 2.038456
H  -1.464604 -0.844082 1.213694
H  -1.74197 -1.678012 -0.311432
H  -3.612702 -0.892746 -1.574147
H  -4.833048 -1.669079 -0.606037
H  -3.369505 -0.820292 2.545841
H  -4.937371 -0.974878 1.796333
H  -4.56078 1.329543 -1.084368
H  -5.751951 0.618113 -0.016105
H  -4.253246 -3.237103 0.86749
H  -2.692708 -3.068842 1.67193
H  -4.168764 -3.162404 2.622183
H  -6.751735 -0.647788 -1.936162
H  -5.539646 0.024736 -3.021272
H  -6.733603 1.078636 -2.274782
elementType: O N C H
totalener: -912.31353914 hartree
nucrepener: 1874.47174210 hartree
electener: -2786.78528124 hartree
oneelecener: -4962.32134624 hartree
twoeener: 2175.53606499 hartree
cpcmener: -0.01577566 hartree
kineticenergy: 907.79353328 hartree
xcener: -92.069691072128 hartree
chargesum: 0.0000000
charge: -0.427025 -0.390128 -0.238873 0.090565 0.581242 -0.220431 -0.240461 0.258520 -0.266067 -0.305594 0.245224 -0.023063 -0.373072 -0.357618 -0.360314 -0.187245 -0.084603 -0.045766 -0.064360 -0.274406 -0.282456 0.055319 0.089531 0.078276 0.081238 0.087842 0.077596 0.083637 0.086420 0.092788 0.082100 0.077409 0.097912 0.097929 0.095181 0.096681 0.098180 0.094098 0.094532 0.094575 0.099208 0.093431 0.098579 0.086352 0.085007 0.082564 0.071420 0.078921 0.050422 0.052771 0.081669 0.082326 0.093253 0.079277 0.078804 0.090682
qa: -0.4270 -0.3901 -0.2389 0.0906 0.5812 -0.2204 -0.2405 0.2585 -0.2661 -0.3056 0.2452 -0.0231 -0.3731 -0.3576 -0.3603 -0.1872 -0.0846 -0.0458 -0.0644 -0.2744 -0.2825 0.0553 0.0895 0.0783 0.0812 0.0878 0.0776 0.0836 0.0864 0.0928 0.0821 0.0774 0.0979 0.0979 0.0952 0.0967 0.0982 0.0941 0.0945 0.0946 0.0992 0.0934 0.0986 0.0864 0.0850 0.0826 0.0714 0.0789 0.0504 0.0528 0.0817 0.0823 0.0933 0.0793 0.0788 0.0907
va: 1.9926 2.0163 2.8408 3.6816 3.7808 3.9092 3.9443 3.6759 4.0531 4.0114 3.7882 3.9801 3.9454 3.9222 3.9250 4.0083 3.8889 3.9586 3.8699 3.9023 3.9548 1.0175 1.0125 1.0216 1.0163 1.0133 1.0300 1.0165 1.0226 1.0107 1.0018 1.0055 0.9969 1.0043 1.0013 1.0002 1.0029 1.0002 1.0068 1.0071 1.0026 0.9993 0.9917 1.0053 1.0010 0.9988 0.9981 0.9942 1.0149 1.0126 1.0029 0.9994 1.0104 1.0018 1.0005 1.0036
dispcorr: -0.028484267 hartree
energy: -912.342023408779
dipole: 0.67368 -1.14407 -0.47039 -11.50085 10.84029 -0.66056 0.93359 -0.48866 0.44493
magnitude: 0.92496 au
magnitude: 2.35107 debye
