program: Orca
programVersion: 5.0.2
elementType: O O N C C C C C C C C C C C C C C C C C C H H H H H H H H H H H H H H H H H H H H H H H H H H H H H H H H H H H
charge: 0
multiplicity: 1
keywords: wb97x-d3
keywords: def2-TZVPP
keywords: def2/J RIJCOSX
keywords: DEFGRID2
keywords: scfconv7
keywords: smallprint printgap noloewdin
keywords: NOSOSCF
formula: C18H35NO2
InChI: InChI=1/C18H35NO2/c1-6-12-19(7-2)13-16-14-20-18(21-16)10-8-15(9-11-18)17(3,4)5/h15-16H,6-14H2,1-5H3
56 atoms
O  -0.30844 0.915662 -0.710191
O  -0.419601 2.412695 0.978998
N  -2.721584 -0.734904 -0.219595
C  3.094226 0.147392 0.105541
C  0.44043 1.487826 0.351865
C  2.640902 1.253433 -0.852725
C  1.864158 -0.576963 0.6623
C  4.16132 -0.80571 -0.496367
C  1.654106 2.217667 -0.198874
C  0.879272 0.390182 1.312445
C  -1.618233 1.456178 -0.720954
C  -1.746799 2.030467 0.678118
C  5.378961 0.003098 -0.955702
C  4.63767 -1.790435 0.576137
C  3.626372 -1.602635 -1.688043
C  -2.66347 0.420266 -1.098402
C  -4.090202 -1.13294 0.075304
C  -1.925265 -1.852559 -0.713237
C  -4.775078 -0.242268 1.101545
C  -1.458051 -2.781574 0.393002
C  -6.217276 -0.661994 1.34224
H  3.583363 0.644095 0.956996
H  3.496076 1.831736 -1.206592
H  2.179721 0.8147 -1.742781
H  1.359217 -1.131764 -0.134526
H  2.158621 -1.317792 1.407705
H  1.331585 2.977684 -0.916267
H  2.148062 2.744147 0.623886
H  1.353989 0.864031 2.177554
H  0.005377 -0.151327 1.686822
H  -1.678915 2.267206 -1.460931
H  -2.123887 1.28378 1.385619
H  -2.39033 2.909949 0.72264
H  5.160698 0.637221 -1.816185
H  5.758839 0.646293 -0.157551
H  6.192679 -0.662983 -1.252175
H  4.972119 -1.269679 1.477329
H  5.480256 -2.381128 0.208698
H  3.860673 -2.496519 0.872319
H  4.408842 -2.247393 -2.095686
H  2.791592 -2.249644 -1.412635
H  3.289289 -0.957405 -2.501559
H  -2.51584 0.125272 -2.147098
H  -3.621359 0.947397 -1.083021
H  -4.701856 -1.177553 -0.842005
H  -4.077096 -2.151306 0.4708
H  -2.475459 -2.430873 -1.473355
H  -1.04758 -1.455523 -1.221281
H  -4.753346 0.802354 0.777109
H  -4.212504 -0.28529 2.038021
H  -0.86293 -2.242232 1.130662
H  -2.286461 -3.258798 0.918575
H  -0.83717 -3.578394 -0.019281
H  -6.698129 -0.024892 2.085513
H  -6.279993 -1.690439 1.703948
H  -6.809699 -0.599985 0.427218
elementType: O N C H
totalener: -912.31435266 hartree
nucrepener: 1930.49428040 hartree
electener: -2842.80863306 hartree
oneelecener: -5074.77740865 hartree
twoeener: 2231.96877559 hartree
cpcmener: -0.01495733 hartree
kineticenergy: 907.79572795 hartree
xcener: -92.069827941743 hartree
chargesum: -0.0000000
charge: -0.422994 -0.397623 -0.230377 0.106284 0.606557 -0.222078 -0.271875 0.265832 -0.277660 -0.283807 0.208216 -0.025171 -0.358533 -0.361825 -0.378602 -0.136255 -0.095166 -0.083014 -0.073563 -0.284182 -0.284079 0.056199 0.087893 0.075410 0.082428 0.094533 0.078159 0.082629 0.088199 0.084234 0.067915 0.072392 0.106165 0.093556 0.099448 0.094302 0.098217 0.095215 0.094486 0.098337 0.093795 0.098220 0.095705 0.099723 0.072714 0.090142 0.078088 0.092490 0.059161 0.054399 0.076500 0.092317 0.096051 0.091433 0.080412 0.079044
qa: -0.4230 -0.3976 -0.2304 0.1063 0.6066 -0.2221 -0.2719 0.2658 -0.2777 -0.2838 0.2082 -0.0252 -0.3585 -0.3618 -0.3786 -0.1363 -0.0952 -0.0830 -0.0736 -0.2842 -0.2841 0.0562 0.0879 0.0754 0.0824 0.0945 0.0782 0.0826 0.0882 0.0842 0.0679 0.0724 0.1062 0.0936 0.0994 0.0943 0.0982 0.0952 0.0945 0.0983 0.0938 0.0982 0.0957 0.0997 0.0727 0.0901 0.0781 0.0925 0.0592 0.0544 0.0765 0.0923 0.0961 0.0914 0.0804 0.0790
va: 1.9854 2.0051 2.7958 3.6925 3.7216 3.9164 3.9670 3.6668 4.0727 3.9986 3.8860 3.9738 3.9229 3.9241 3.9475 3.9118 3.9081 3.8719 3.8380 3.9294 3.9675 1.0179 1.0133 1.0228 0.9955 1.0097 1.0227 1.0168 1.0260 1.0226 1.0053 1.0185 0.9958 0.9991 1.0024 1.0074 1.0029 1.0066 0.9992 1.0046 1.0013 1.0004 1.0083 1.0006 1.0038 0.9969 1.0076 1.0027 1.0109 1.0155 1.0035 1.0044 1.0071 1.0033 1.0001 1.0017
dispcorr: -0.030567994 hartree
energy: -912.344920653132
dipole: 2.10468 -2.78030 -0.67562 -13.78748 13.49503 -0.29245 -0.30584 -0.01137 -0.31721
magnitude: 0.80163 au
magnitude: 2.03758 debye
