program: Orca
programVersion: 5.0.2
elementType: O O N C C C C C C C C C C C C C C C C C C H H H H H H H H H H H H H H H H H H H H H H H H H H H H H H H H H H H
charge: 0
multiplicity: 1
keywords: wb97x-d3
keywords: def2-TZVPP
keywords: def2/J RIJCOSX
keywords: DEFGRID2
keywords: scfconv7
keywords: smallprint printgap noloewdin
keywords: NOSOSCF
formula: C18H35NO2
InChI: InChI=1/C18H35NO2/c1-6-12-19(7-2)13-16-14-20-18(21-16)10-8-15(9-11-18)17(3,4)5/h15-16H,6-14H2,1-5H3
56 atoms
O  -0.295554 0.83322 -0.70999
O  -0.414345 2.392001 0.924508
N  -2.766184 -0.744827 -0.217539
C  3.127098 0.141305 0.129707
C  0.451843 1.452698 0.325816
C  2.659023 1.206537 -0.867267
C  1.905405 -0.583136 0.70458
C  4.215326 -0.807779 -0.44148
C  1.65636 2.178886 -0.251685
C  0.906167 0.392924 1.320619
C  -1.594023 1.398822 -0.768532
C  -1.740557 2.019859 0.608462
C  3.7501 -1.533064 -1.705993
C  5.476262 -0.003025 -0.77332
C  4.600791 -1.855682 0.607414
C  -2.652726 0.372664 -1.136835
C  -4.149953 -1.09042 0.068971
C  -1.990766 -1.90305 -0.644683
C  -4.831707 -0.130802 1.034349
C  -1.579592 -2.800369 0.509411
C  -6.291165 -0.498347 1.257155
H  3.601171 0.671028 0.969642
H  3.506602 1.782076 -1.243578
H  2.204131 0.72824 -1.739661
H  1.412123 -1.174309 -0.073701
H  2.207268 -1.290961 1.477935
H  1.324156 2.906361 -0.998025
H  2.139742 2.74413 0.551413
H  1.375917 0.901749 2.168461
H  0.040294 -0.147012 1.715623
H  -1.623047 2.186293 -1.535333
H  -2.143314 1.303224 1.332523
H  -2.371175 2.90991 0.609946
H  4.515439 -2.23572 -2.044492
H  2.836843 -2.108609 -1.541211
H  3.562319 -0.845403 -2.532428
H  5.312343 0.730468 -1.564065
H  6.27707 -0.663486 -1.114719
H  5.848054 0.534475 0.103058
H  3.800576 -2.572091 0.798772
H  5.467758 -2.43047 0.273165
H  4.8658 -1.392168 1.561372
H  -2.48163 0.034816 -2.169016
H  -3.596601 0.923596 -1.171994
H  -4.745981 -1.168508 -0.856806
H  -4.171609 -2.086291 0.517729
H  -2.536753 -2.495195 -1.397633
H  -1.087731 -1.551535 -1.142749
H  -4.772027 0.896157 0.661816
H  -4.293425 -0.144292 1.986135
H  -0.97992 -2.250419 1.236598
H  -2.434883 -3.225483 1.037261
H  -0.980161 -3.635777 0.14356
H  -6.771755 0.185027 1.95844
H  -6.392832 -1.507262 1.662567
H  -6.858328 -0.461511 0.324735
elementType: O N C H
totalener: -912.31444367 hartree
nucrepener: 1925.21232048 hartree
electener: -2837.52676415 hartree
oneelecener: -5064.22508714 hartree
twoeener: 2226.69832299 hartree
cpcmener: -0.01504457 hartree
kineticenergy: 907.78335965 hartree
xcener: -92.067192326404 hartree
chargesum: -0.0000000
charge: -0.422699 -0.398429 -0.230350 0.101871 0.604991 -0.224050 -0.258027 0.259670 -0.277742 -0.287142 0.203878 -0.022314 -0.373913 -0.355675 -0.362333 -0.132760 -0.095773 -0.083763 -0.074383 -0.279161 -0.284304 0.056170 0.088736 0.076789 0.082352 0.090073 0.078430 0.083486 0.088280 0.086449 0.067314 0.071561 0.105161 0.097425 0.096805 0.094964 0.094539 0.094244 0.096496 0.093858 0.095311 0.099301 0.095454 0.100124 0.072752 0.090816 0.077243 0.091953 0.059549 0.055026 0.074916 0.090509 0.094941 0.091465 0.080749 0.079163
qa: -0.4227 -0.3984 -0.2303 0.1019 0.6050 -0.2240 -0.2580 0.2597 -0.2777 -0.2871 0.2039 -0.0223 -0.3739 -0.3557 -0.3623 -0.1328 -0.0958 -0.0838 -0.0744 -0.2792 -0.2843 0.0562 0.0887 0.0768 0.0824 0.0901 0.0784 0.0835 0.0883 0.0864 0.0673 0.0716 0.1052 0.0974 0.0968 0.0950 0.0945 0.0942 0.0965 0.0939 0.0953 0.0993 0.0955 0.1001 0.0728 0.0908 0.0772 0.0920 0.0595 0.0550 0.0749 0.0905 0.0949 0.0915 0.0807 0.0792
va: 1.9861 2.0034 2.8002 3.6878 3.7215 3.9201 3.9547 3.6735 4.0757 4.0070 3.8957 3.9730 3.9471 3.9220 3.9270 3.9063 3.9081 3.8794 3.8378 3.9305 3.9679 1.0174 1.0146 1.0203 0.9996 1.0109 1.0217 1.0170 1.0254 1.0196 1.0056 1.0208 0.9956 1.0050 1.0021 0.9991 1.0022 1.0062 1.0034 0.9974 1.0072 1.0023 1.0085 1.0004 1.0037 0.9964 1.0072 1.0021 1.0109 1.0150 1.0046 1.0041 1.0073 1.0034 1.0000 1.0016
dispcorr: -0.030315789 hartree
energy: -912.344759462168
dipole: 2.01108 -2.67756 -0.66647 -13.32815 13.05838 -0.26977 -0.03828 -0.30123 -0.33952
magnitude: 0.79513 au
magnitude: 2.02106 debye
