program: Orca
programVersion: 5.0.2
elementType: O O N C C C C C C C C C C C C C C C C C C H H H H H H H H H H H H H H H H H H H H H H H H H H H H H H H H H H H
charge: 0
multiplicity: 1
keywords: wb97x-d3
keywords: def2-TZVPP
keywords: def2/J RIJCOSX
keywords: DEFGRID2
keywords: scfconv7
keywords: smallprint printgap noloewdin
keywords: NOSOSCF
formula: C18H35NO2
InChI: InChI=1/C18H35NO2/c1-6-12-19(7-2)13-16-14-20-18(21-16)10-8-15(9-11-18)17(3,4)5/h15-16H,6-14H2,1-5H3
56 atoms
O  -0.321798 0.633624 0.408477
O  -0.113593 2.884297 0.449829
N  -3.056428 -0.882985 0.231217
C  3.212244 0.273507 -0.154947
C  0.619596 1.679735 0.296109
C  2.160054 0.421614 -1.258685
C  2.516762 0.284133 1.210489
C  4.174015 -0.927765 -0.361329
C  1.294409 1.66452 -1.069781
C  1.652896 1.527992 1.40051
C  -1.616852 1.158872 0.173276
C  -1.466048 2.573255 0.707699
C  5.229992 -0.942665 0.747975
C  3.437434 -2.269243 -0.353055
C  4.910191 -0.777867 -1.69668
C  -2.697074 0.363412 0.881097
C  -4.443775 -1.242815 0.491058
C  -2.143742 -1.97524 0.547052
C  -5.448158 -0.458416 -0.345154
C  -2.145006 -3.066304 -0.511392
C  -5.274963 -0.653652 -1.84311
H  3.845448 1.172987 -0.194849
H  2.635635 0.484361 -2.238889
H  1.517706 -0.464046 -1.286234
H  1.899309 -0.611818 1.327881
H  3.250898 0.257011 2.017633
H  0.538262 1.722998 -1.859047
H  1.915354 2.561593 -1.16075
H  2.292578 2.416497 1.394063
H  1.151035 1.501564 2.372323
H  -1.837497 1.178216 -0.902749
H  -1.687447 2.618541 1.782458
H  -2.112582 3.287542 0.19493
H  5.99006 -1.700453 0.544267
H  5.742379 0.01973 0.827298
H  4.807341 -1.173537 1.726793
H  2.706345 -2.345053 -1.16035
H  2.911347 -2.447323 0.587168
H  4.145205 -3.09188 -0.483809
H  5.405211 0.194058 -1.773633
H  5.681395 -1.545342 -1.799158
H  4.246448 -0.879226 -2.55652
H  -3.578737 1.009742 0.893203
H  -2.411605 0.223398 1.937062
H  -4.574348 -2.302167 0.260314
H  -4.691638 -1.13771 1.560738
H  -1.132486 -1.577473 0.617846
H  -2.365415 -2.411583 1.536438
H  -5.401626 0.607851 -0.103968
H  -6.44885 -0.783945 -0.046304
H  -1.42081 -3.841145 -0.253052
H  -3.114952 -3.555045 -0.616225
H  -1.869423 -2.659805 -1.486929
H  -6.043358 -0.118555 -2.403075
H  -5.344822 -1.709407 -2.116108
H  -4.306288 -0.291815 -2.186873
elementType: O N C H
totalener: -912.31508620 hartree
nucrepener: 1901.00601580 hartree
electener: -2813.32110200 hartree
oneelecener: -5015.62691731 hartree
twoeener: 2202.30581531 hartree
cpcmener: -0.01491261 hartree
kineticenergy: 907.77565388 hartree
xcener: -92.063591867949 hartree
chargesum: 0.0000000
charge: -0.395612 -0.403824 -0.237255 0.086148 0.571299 -0.233996 -0.230113 0.259930 -0.269770 -0.257463 0.161206 0.018109 -0.358876 -0.373883 -0.359424 -0.143366 -0.112674 -0.051006 -0.077430 -0.267359 -0.281113 0.057168 0.086960 0.080158 0.079227 0.087861 0.083102 0.085270 0.079785 0.080857 0.055069 0.072265 0.095838 0.094396 0.098981 0.093777 0.095139 0.096587 0.098003 0.099079 0.094730 0.094037 0.109916 0.081613 0.100619 0.087279 0.084163 0.069258 0.055984 0.069317 0.092278 0.080305 0.072897 0.094175 0.079012 0.071367
qa: -0.3956 -0.4038 -0.2373 0.0861 0.5713 -0.2340 -0.2301 0.2599 -0.2698 -0.2575 0.1612 0.0181 -0.3589 -0.3739 -0.3594 -0.1434 -0.1127 -0.0510 -0.0774 -0.2674 -0.2811 0.0572 0.0870 0.0802 0.0792 0.0879 0.0831 0.0853 0.0798 0.0809 0.0551 0.0723 0.0958 0.0944 0.0990 0.0938 0.0951 0.0966 0.0980 0.0991 0.0947 0.0940 0.1099 0.0816 0.1006 0.0873 0.0842 0.0693 0.0560 0.0693 0.0923 0.0803 0.0729 0.0942 0.0790 0.0714
va: 1.9959 1.9991 2.7926 3.6895 3.7574 3.9411 3.9380 3.6758 4.0432 4.0517 3.9336 3.9928 3.9248 3.9463 3.9223 3.9526 3.9059 3.8859 3.8417 3.9242 3.9237 1.0168 1.0142 1.0129 1.0124 1.0122 1.0152 1.0190 1.0199 1.0226 1.0194 0.9971 0.9931 1.0072 1.0025 0.9991 1.0003 1.0008 1.0043 1.0026 1.0066 0.9998 0.9943 1.0232 0.9882 1.0107 1.0041 1.0073 1.0121 1.0123 1.0092 1.0042 1.0120 1.0059 1.0009 1.0198
dispcorr: -0.028763929 hartree
energy: -912.343850126679
dipole: 2.14020 -2.63901 -0.49881 -14.38941 14.24367 -0.14574 -4.52352 4.81035 0.28684
magnitude: 0.59357 au
magnitude: 1.50873 debye
