program: Orca
programVersion: 5.0.2
elementType: O O N C C C C C C C C C C C C C C C C C C H H H H H H H H H H H H H H H H H H H H H H H H H H H H H H H H H H H
charge: 0
multiplicity: 1
keywords: wb97x-d3
keywords: def2-TZVPP
keywords: def2/J RIJCOSX
keywords: DEFGRID2
keywords: scfconv7
keywords: smallprint printgap noloewdin
keywords: NOSOSCF
formula: C18H35NO2
InChI: InChI=1/C18H35NO2/c1-6-12-19(7-2)13-16-14-20-18(21-16)10-8-15(9-11-18)17(3,4)5/h15-16H,6-14H2,1-5H3
56 atoms
O  -0.065683 0.570598 -0.820685
O  -0.375898 2.091589 0.798781
N  -3.485626 -0.734217 -0.312186
C  3.411024 0.263287 0.07297
C  0.599862 1.25544 0.2277
C  2.833471 1.24897 -0.947505
C  2.27324 -0.594547 0.636881
C  4.615807 -0.557143 -0.46072
C  1.71751 2.103474 -0.351507
C  1.163401 0.262081 1.241396
C  -1.467325 0.609968 -0.600453
C  -1.610606 1.414301 0.693288
C  4.217029 -1.493372 -1.60293
C  5.709817 0.391472 -0.961888
C  5.217468 -1.393398 0.672966
C  -2.046677 -0.791549 -0.497202
C  -3.986366 -1.842287 0.488497
C  -4.200202 -0.591109 -1.573202
C  -3.812558 -1.627911 1.98649
C  -5.538632 0.106648 -1.411912
C  -4.62071 -0.453502 2.515871
H  3.802424 0.863522 0.908154
H  3.609219 1.920477 -1.318552
H  2.453617 0.708644 -1.81957
H  1.853875 -1.229125 -0.149842
H  2.64257 -1.270461 1.410148
H  1.309113 2.780487 -1.10673
H  2.126421 2.727495 0.449279
H  1.561559 0.82819 2.089582
H  0.367954 -0.377646 1.636013
H  -1.928803 1.147435 -1.437158
H  -1.78829 0.760097 1.556629
H  -2.413372 2.150347 0.656099
H  5.093324 -2.020833 -1.987483
H  3.501789 -2.253423 -1.283178
H  3.773763 -0.954803 -2.442588
H  5.976466 1.132211 -0.203492
H  5.418866 0.931767 -1.863869
H  6.617357 -0.16569 -1.206123
H  6.117947 -1.910248 0.332587
H  5.502971 -0.768745 1.523651
H  4.532886 -2.158957 1.040789
H  -1.588847 -1.283861 0.364959
H  -1.765152 -1.388457 -1.37899
H  -5.053705 -1.963067 0.287187
H  -3.516659 -2.792848 0.189122
H  -3.587873 -0.000098 -2.257338
H  -4.340532 -1.565898 -2.067326
H  -2.754079 -1.492698 2.229762
H  -4.119106 -2.545183 2.497189
H  -5.405033 1.114896 -1.016678
H  -6.04293 0.188173 -2.37616
H  -6.210205 -0.429666 -0.739361
H  -5.691072 -0.610245 2.363865
H  -4.352095 0.476005 2.013275
H  -4.461844 -0.309139 3.585711
elementType: O N C H
totalener: -912.31490403 hartree
nucrepener: 1890.60515794 hartree
electener: -2802.92006197 hartree
oneelecener: -4994.54350489 hartree
twoeener: 2191.62344292 hartree
cpcmener: -0.01534894 hartree
kineticenergy: 907.79245752 hartree
xcener: -92.068045287308 hartree
chargesum: -0.0000000
charge: -0.428094 -0.391318 -0.238053 0.089940 0.579738 -0.218929 -0.244116 0.260531 -0.271585 -0.298769 0.252304 -0.024383 -0.373534 -0.359979 -0.358288 -0.197716 -0.102642 -0.048257 -0.095324 -0.266801 -0.283980 0.056505 0.087899 0.077491 0.082433 0.088229 0.078141 0.084316 0.086973 0.089297 0.082928 0.080544 0.102662 0.097499 0.093438 0.097988 0.099256 0.094265 0.094723 0.095477 0.097697 0.093607 0.103337 0.087740 0.093794 0.088368 0.080399 0.070934 0.057697 0.074311 0.074337 0.092722 0.080320 0.083991 0.072803 0.097134
qa: -0.4281 -0.3913 -0.2381 0.0899 0.5797 -0.2189 -0.2441 0.2605 -0.2716 -0.2988 0.2523 -0.0244 -0.3735 -0.3600 -0.3583 -0.1977 -0.1026 -0.0483 -0.0953 -0.2668 -0.2840 0.0565 0.0879 0.0775 0.0824 0.0882 0.0781 0.0843 0.0870 0.0893 0.0829 0.0805 0.1027 0.0975 0.0934 0.0980 0.0993 0.0943 0.0947 0.0955 0.0977 0.0936 0.1033 0.0877 0.0938 0.0884 0.0804 0.0709 0.0577 0.0743 0.0743 0.0927 0.0803 0.0840 0.0728 0.0971
va: 1.9894 2.0203 2.7602 3.6822 3.7828 3.9083 3.9471 3.6748 4.0596 4.0176 3.7552 3.9881 3.9463 3.9242 3.9232 4.0055 3.9047 3.8930 3.8538 3.9271 3.9171 1.0170 1.0126 1.0224 1.0159 1.0136 1.0291 1.0163 1.0222 1.0126 1.0032 1.0033 0.9945 1.0044 1.0005 1.0007 1.0027 0.9986 1.0072 1.0062 1.0032 1.0013 0.9905 1.0170 0.9919 1.0099 0.9948 1.0055 1.0097 1.0149 1.0093 1.0103 1.0024 1.0020 1.0133 1.0049
dispcorr: -0.029400379 hartree
energy: -912.344304411082
dipole: 1.23719 -1.63994 -0.40276 -9.36342 8.57814 -0.78528 0.74550 -0.68046 0.06504
magnitude: 0.88493 au
magnitude: 2.24932 debye
