program: Orca
programVersion: 5.0.2
elementType: O O N C C C C C C C C C C C C C C C C C C H H H H H H H H H H H H H H H H H H H H H H H H H H H H H H H H H H H
charge: 0
multiplicity: 1
keywords: wb97x-d3
keywords: def2-TZVPP
keywords: def2/J RIJCOSX
keywords: DEFGRID2
keywords: scfconv7
keywords: smallprint printgap noloewdin
keywords: NOSOSCF
formula: C18H35NO2
InChI: InChI=1/C18H35NO2/c1-6-12-19(7-2)13-16-14-20-18(21-16)10-8-15(9-11-18)17(3,4)5/h15-16H,6-14H2,1-5H3
56 atoms
O  -0.294889 0.605269 0.122817
O  -0.128265 2.856812 0.242109
N  -3.065679 -0.917676 0.374993
C  3.259372 0.323226 -0.315602
C  0.632793 1.676761 0.08732
C  2.239156 0.48119 -1.447849
C  2.516169 0.279611 1.023477
C  4.250664 -0.854948 -0.514422
C  1.350253 1.707122 -1.252765
C  1.633769 1.507877 1.222475
C  -1.618167 1.112779 0.180826
C  -1.391566 2.499493 0.757487
C  4.910619 -0.759572 -1.893864
C  5.364614 -0.767304 0.533026
C  3.563217 -2.216418 -0.391909
C  -2.531085 0.255814 1.03904
C  -4.310286 -1.353785 0.992865
C  -2.103588 -2.008032 0.273369
C  -5.519356 -0.503517 0.622665
C  -2.421959 -2.97562 -0.853682
C  -5.814377 -0.486492 -0.868695
H  3.87362 1.236228 -0.314345
H  2.743193 0.581292 -2.410175
H  1.614685 -0.414796 -1.521768
H  1.900005 -0.622414 1.082423
H  3.219337 0.223079 1.856361
H  0.615908 1.776624 -2.060629
H  1.963834 2.612318 -1.301563
H  2.261592 2.40359 1.260078
H  1.105488 1.448165 2.178685
H  -2.044914 1.184433 -0.828587
H  -1.394891 2.48238 1.856128
H  -2.135035 3.2250 0.425315
H  5.729515 -1.478004 -1.977434
H  4.216285 -0.974081 -2.707429
H  5.33105 0.234057 -2.070088
H  6.103743 -1.557123 0.378932
H  4.993424 -0.874888 1.553176
H  5.891964 0.188322 0.472709
H  4.269479 -3.021337 -0.609655
H  3.176499 -2.395715 0.612849
H  2.730456 -2.323149 -1.090131
H  -3.371475 0.89832 1.314193
H  -2.015645 0.014042 1.984132
H  -4.514241 -2.37708 0.670751
H  -4.216332 -1.399708 2.09093
H  -1.117334 -1.58917 0.08263
H  -2.017074 -2.558344 1.225015
H  -5.399509 0.521055 0.986502
H  -6.380285 -0.906705 1.163306
H  -1.655301 -3.749996 -0.909805
H  -3.379661 -3.481567 -0.723383
H  -2.445729 -2.458668 -1.813961
H  -4.999161 -0.035607 -1.434573
H  -6.719483 0.082838 -1.085616
H  -5.963354 -1.497445 -1.255094
elementType: O N C H
totalener: -912.31494737 hartree
nucrepener: 1895.61894472 hartree
electener: -2807.93389209 hartree
oneelecener: -5004.82284164 hartree
twoeener: 2196.88894955 hartree
cpcmener: -0.01482491 hartree
kineticenergy: 907.79513151 hartree
xcener: -92.067550386529 hartree
chargesum: -0.0000000
charge: -0.399426 -0.395373 -0.237262 0.082733 0.570896 -0.220337 -0.228781 0.258416 -0.268377 -0.269062 0.176313 -0.000658 -0.360961 -0.355380 -0.372995 -0.151252 -0.109739 -0.045598 -0.082564 -0.268634 -0.280791 0.055726 0.085016 0.077182 0.078763 0.088611 0.080405 0.083761 0.079285 0.082891 0.056635 0.076944 0.103282 0.094813 0.094002 0.099650 0.094270 0.094444 0.095844 0.098065 0.094050 0.098352 0.110982 0.080346 0.101754 0.085388 0.083237 0.067350 0.056725 0.069911 0.092321 0.079606 0.073617 0.072865 0.093834 0.078907
qa: -0.3994 -0.3954 -0.2373 0.0827 0.5709 -0.2203 -0.2288 0.2584 -0.2684 -0.2691 0.1763 -0.0007 -0.3610 -0.3554 -0.3730 -0.1513 -0.1097 -0.0456 -0.0826 -0.2686 -0.2808 0.0557 0.0850 0.0772 0.0788 0.0886 0.0804 0.0838 0.0793 0.0829 0.0566 0.0769 0.1033 0.0948 0.0940 0.0996 0.0943 0.0944 0.0958 0.0981 0.0940 0.0984 0.1110 0.0803 0.1018 0.0854 0.0832 0.0673 0.0567 0.0699 0.0923 0.0796 0.0736 0.0729 0.0938 0.0789
va: 1.9871 2.0048 2.8064 3.6963 3.7542 3.9214 3.9383 3.6731 4.0494 4.0520 3.8850 3.9947 3.9263 3.9240 3.9464 3.9582 3.9038 3.8809 3.8446 3.9261 3.9249 1.0170 1.0143 1.0166 1.0138 1.0139 1.0208 1.0172 1.0214 1.0164 1.0228 0.9987 0.9936 1.0073 0.9970 1.0020 1.0058 1.0025 1.0036 1.0047 0.9988 1.0010 0.9914 1.0221 0.9871 1.0120 1.0067 1.0073 1.0115 1.0123 1.0090 1.0045 1.0115 1.0192 1.0059 1.0010
dispcorr: -0.028642179 hartree
energy: -912.343589548184
dipole: 1.77680 -2.10675 -0.32995 -13.96557 13.81786 -0.14771 -2.56238 3.13586 0.57348
magnitude: 0.67791 au
magnitude: 1.72311 debye
