program: Orca
programVersion: 5.0.2
elementType: O O N C C C C C C C C C C C C C C C C C C H H H H H H H H H H H H H H H H H H H H H H H H H H H H H H H H H H H
charge: 0
multiplicity: 1
keywords: wb97x-d3
keywords: def2-TZVPP
keywords: def2/J RIJCOSX
keywords: DEFGRID2
keywords: scfconv7
keywords: smallprint printgap noloewdin
keywords: NOSOSCF
formula: C18H35NO2
InChI: InChI=1/C18H35NO2/c1-6-12-19(7-2)13-16-14-20-18(21-16)10-8-15(9-11-18)17(3,4)5/h15-16H,6-14H2,1-5H3
56 atoms
O  -0.260183 0.748188 0.322957
O  0.001755 2.964228 0.653054
N  -3.079135 -0.575614 -0.327361
C  3.263221 0.361372 -0.274986
C  0.707631 1.771491 0.344494
C  2.218503 0.673511 -1.351805
C  2.559665 0.220861 1.078832
C  4.190064 -0.832454 -0.630207
C  1.392659 1.910039 -1.010183
C  1.73015 1.455369 1.422262
C  -1.515573 1.336494 0.027497
C  -1.3798 2.679892 0.72763
C  4.971115 -0.514764 -1.909194
C  5.212358 -1.051135 0.490321
C  3.411224 -2.132461 -0.838872
C  -2.671677 0.503681 0.550916
C  -4.460596 -0.972992 -0.107142
C  -2.131865 -1.68154 -0.342159
C  -4.790391 -1.665511 1.215575
C  -2.473752 -2.765584 -1.348301
C  -6.276479 -1.974118 1.319938
H  3.920629 1.240745 -0.201636
H  2.695901 0.836709 -2.319534
H  1.549628 -0.182353 -1.482988
H  1.915061 -0.663562 1.07905
H  3.286732 0.069148 1.878277
H  0.648422 2.097369 -1.79036
H  2.043826 2.789422 -0.980941
H  2.392153 2.320002 1.529066
H  1.222442 1.321405 2.381816
H  -1.636658 1.476823 -1.055282
H  -1.711418 2.617488 1.772582
H  -1.951723 3.46859 0.234808
H  5.520163 0.42612 -1.81713
H  5.702161 -1.299081 -2.119067
H  4.328095 -0.43773 -2.787046
H  5.745279 -0.12829 0.734511
H  5.959491 -1.788414 0.187375
H  4.755754 -1.422406 1.408931
H  4.09637 -2.956287 -1.05334
H  2.837974 -2.416546 0.045821
H  2.715171 -2.069852 -1.677275
H  -3.522677 1.18453 0.649061
H  -2.42421 0.172594 1.573019
H  -5.078324 -0.073515 -0.196989
H  -4.773723 -1.620629 -0.930958
H  -1.152704 -1.283191 -0.60758
H  -2.009041 -2.136997 0.653894
H  -4.48964 -1.034687 2.05718
H  -4.219773 -2.593899 1.308852
H  -3.368222 -3.33078 -1.082924
H  -2.620196 -2.347563 -2.345777
H  -1.650526 -3.479037 -1.406956
H  -6.519722 -2.464072 2.263647
H  -6.604033 -2.635608 0.514968
H  -6.877539 -1.064217 1.259082
elementType: O N C H
totalener: -912.31544822 hartree
nucrepener: 1887.90603917 hartree
electener: -2800.22148739 hartree
oneelecener: -4989.32413857 hartree
twoeener: 2189.10265118 hartree
cpcmener: -0.01554625 hartree
kineticenergy: 907.78933174 hartree
xcener: -92.069475221299 hartree
chargesum: 0.0000000
charge: -0.397344 -0.407400 -0.209748 0.090482 0.578770 -0.242411 -0.228303 0.260598 -0.268148 -0.259440 0.142999 0.024248 -0.358718 -0.359197 -0.374895 -0.113239 -0.119337 -0.073957 -0.082819 -0.270036 -0.279439 0.056825 0.088253 0.080089 0.079232 0.087564 0.085236 0.085615 0.080810 0.080279 0.051949 0.073631 0.092067 0.097465 0.094712 0.094268 0.099325 0.094194 0.093535 0.098116 0.097359 0.095281 0.101420 0.069124 0.088481 0.092432 0.082322 0.069143 0.067501 0.060695 0.082895 0.080997 0.094630 0.091760 0.080571 0.079559
qa: -0.3973 -0.4074 -0.2097 0.0905 0.5788 -0.2424 -0.2283 0.2606 -0.2681 -0.2594 0.1430 0.0242 -0.3587 -0.3592 -0.3749 -0.1132 -0.1193 -0.0740 -0.0828 -0.2700 -0.2794 0.0568 0.0883 0.0801 0.0792 0.0876 0.0852 0.0856 0.0808 0.0803 0.0519 0.0736 0.0921 0.0975 0.0947 0.0943 0.0993 0.0942 0.0935 0.0981 0.0974 0.0953 0.1014 0.0691 0.0885 0.0924 0.0823 0.0691 0.0675 0.0607 0.0829 0.0810 0.0946 0.0918 0.0806 0.0796
va: 1.9935 1.9962 2.9190 3.6826 3.7519 3.9545 3.9289 3.6754 4.0441 4.0486 3.9240 3.9930 3.9223 3.9248 3.9457 3.9213 3.9704 3.9221 3.8109 3.9140 3.9527 1.0169 1.0150 1.0081 1.0158 1.0117 1.0131 1.0203 1.0192 1.0249 1.0291 0.9964 0.9934 1.0030 1.0065 1.0006 1.0024 1.0075 0.9982 1.0046 1.0009 0.9999 0.9951 1.0184 1.0006 0.9909 1.0044 0.9971 1.0092 1.0067 0.9977 1.0109 1.0053 1.0022 1.0016 1.0015
dispcorr: -0.028378627 hartree
energy: -912.343826843320
dipole: 0.55036 -1.01215 -0.46179 -16.45902 16.20559 -0.25343 -2.28421 2.40194 0.11773
magnitude: 0.53975 au
magnitude: 1.37195 debye
