program: Orca
programVersion: 5.0.2
elementType: O O N C C C C C C C C C C C C C C C C C C H H H H H H H H H H H H H H H H H H H H H H H H H H H H H H H H H H H
charge: 0
multiplicity: 1
keywords: wb97x-d3
keywords: def2-TZVPP
keywords: def2/J RIJCOSX
keywords: DEFGRID2
keywords: scfconv7
keywords: smallprint printgap noloewdin
keywords: NOSOSCF
formula: C18H35NO2
InChI: InChI=1/C18H35NO2/c1-6-12-19(7-2)13-16-14-20-18(21-16)10-8-15(9-11-18)17(3,4)5/h15-16H,6-14H2,1-5H3
56 atoms
O  -0.40065 0.973753 -0.414917
O  -0.071972 3.102155 0.21475
N  -3.126047 -0.578411 0.178443
C  3.103728 0.263091 -0.115231
C  0.601999 1.886485 -0.000822
C  2.404218 0.781826 -1.376107
C  2.072888 0.09677 1.005637
C  3.969048 -1.003139 -0.355962
C  1.619049 2.063404 -1.11275
C  1.289519 1.380594 1.265228
C  -1.684292 1.462081 -0.049116
C  -1.365565 2.776792 0.66694
C  4.975574 -0.739728 -1.480602
C  4.768235 -1.333001 0.909017
C  3.123055 -2.221695 -0.732135
C  -2.470863 0.524836 0.850639
C  -4.105209 -1.200469 1.056455
C  -2.22379 -1.530325 -0.454519
C  -4.996554 -2.229191 0.373928
C  -1.32416 -2.347111 0.469097
C  -5.727251 -1.696951 -0.848775
H  3.802746 1.050329 0.204639
H  3.132818 0.98956 -2.161315
H  1.731641 0.018172 -1.778723
H  1.374526 -0.706414 0.754362
H  2.559614 -0.202059 1.935753
H  1.112515 2.395153 -2.023313
H  2.310813 2.8601 -0.821846
H  1.970741 2.160213 1.620882
H  0.55569 1.215178 2.059924
H  -2.261482 1.6471 -0.962665
H  -1.395818 2.657859 1.758422
H  -2.05217 3.580248 0.398018
H  5.68844 -1.56409 -1.556546
H  4.498073 -0.642109 -2.456644
H  5.550258 0.172613 -1.300023
H  5.370855 -0.480888 1.234402
H  5.452215 -2.164974 0.725714
H  4.131731 -1.625132 1.745457
H  2.521604 -2.048503 -1.626728
H  3.765477 -3.080817 -0.940332
H  2.445128 -2.51889 0.069917
H  -3.261023 1.133279 1.303962
H  -1.82143 0.211852 1.686061
H  -3.639777 -1.665781 1.940977
H  -4.746406 -0.402932 1.445328
H  -2.822644 -2.216841 -1.057659
H  -1.604989 -0.994133 -1.174088
H  -5.725969 -2.561172 1.117841
H  -4.425652 -3.122989 0.107572
H  -0.692355 -1.718391 1.097951
H  -1.893343 -3.005718 1.127527
H  -0.661889 -2.978673 -0.125793
H  -6.302427 -0.800372 -0.606913
H  -6.425778 -2.437237 -1.241757
H  -5.041616 -1.43678 -1.655675
elementType: O N C H
totalener: -912.31396358 hartree
nucrepener: 1923.34125698 hartree
electener: -2835.65522055 hartree
oneelecener: -5060.18980806 hartree
twoeener: 2224.53458750 hartree
cpcmener: -0.01570809 hartree
kineticenergy: 907.78696455 hartree
xcener: -92.072661030748 hartree
chargesum: -0.0000000
charge: -0.402872 -0.385455 -0.186385 0.097760 0.562090 -0.216061 -0.228974 0.267743 -0.274621 -0.282643 0.241986 -0.028511 -0.357184 -0.362197 -0.381466 -0.215082 -0.114123 -0.067567 -0.093171 -0.308057 -0.280056 0.056959 0.087757 0.077349 0.050954 0.089701 0.078126 0.083752 0.085183 0.090710 0.071835 0.081225 0.106608 0.094781 0.094113 0.098638 0.097622 0.094927 0.095527 0.099627 0.099867 0.091237 0.099937 0.078383 0.084895 0.091004 0.083536 0.084343 0.072498 0.062121 0.088606 0.097498 0.097529 0.079478 0.092523 0.076001
qa: -0.4029 -0.3855 -0.1864 0.0978 0.5621 -0.2161 -0.2290 0.2677 -0.2746 -0.2826 0.2420 -0.0285 -0.3572 -0.3622 -0.3815 -0.2151 -0.1141 -0.0676 -0.0932 -0.3081 -0.2801 0.0570 0.0878 0.0773 0.0510 0.0897 0.0781 0.0838 0.0852 0.0907 0.0718 0.0812 0.1066 0.0948 0.0941 0.0986 0.0976 0.0949 0.0955 0.0996 0.0999 0.0912 0.0999 0.0784 0.0849 0.0910 0.0835 0.0843 0.0725 0.0621 0.0886 0.0975 0.0975 0.0795 0.0925 0.0760
va: 1.9771 2.0153 2.8943 3.6853 3.7770 3.9164 3.9909 3.6719 4.0539 4.0189 3.7436 4.0011 3.9218 3.9226 3.9498 3.9994 3.9224 3.9269 3.8471 3.9068 3.9490 1.0171 1.0127 1.0175 1.0173 1.0155 1.0293 1.0165 1.0230 1.0128 1.0179 0.9991 0.9939 1.0073 0.9978 1.0027 1.0030 1.0066 1.0000 1.0003 1.0061 0.9991 1.0021 0.9941 0.9993 0.9978 0.9919 1.0197 1.0084 1.0038 0.9927 0.9996 1.0096 1.0014 1.0051 1.0070
dispcorr: -0.030441223 hartree
energy: -912.344404798504
dipole: 2.94740 -3.13365 -0.18625 -17.30096 16.97992 -0.32105 0.67996 0.09563 0.77559
magnitude: 0.85982 au
magnitude: 2.18550 debye
