program: Orca
programVersion: 5.0.2
elementType: O O N C C C C C C C C C C C C C C C C C C H H H H H H H H H H H H H H H H H H H H H H H H H H H H H H H H H H H
charge: 0
multiplicity: 1
keywords: wb97x-d3
keywords: def2-TZVPP
keywords: def2/J RIJCOSX
keywords: DEFGRID2
keywords: scfconv7
keywords: smallprint printgap noloewdin
keywords: NOSOSCF
formula: C18H35NO2
InChI: InChI=1/C18H35NO2/c1-6-12-19(7-2)13-16-14-20-18(21-16)10-8-15(9-11-18)17(3,4)5/h15-16H,6-14H2,1-5H3
56 atoms
O  -0.295924 0.758379 -0.683443
O  -0.443938 2.374351 0.893554
N  -2.782352 -0.79504 -0.191576
C  3.152143 0.202773 0.116078
C  0.444279 1.441134 0.314679
C  2.639044 1.22014 -0.90789
C  1.96189 -0.534234 0.739017
C  4.255379 -0.738928 -0.437662
C  1.617141 2.182489 -0.307774
C  0.944803 0.432903 1.339509
C  -1.59035 1.323965 -0.7884
C  -1.762806 1.983947 0.566737
C  5.452163 0.092248 -0.910792
C  4.750647 -1.66923 0.673862
C  3.759699 -1.592941 -1.60605
C  -2.638098 0.28495 -1.149826
C  -4.17552 -1.134904 0.053665
C  -1.987102 -1.966723 -0.536826
C  -4.896059 -0.13861 0.951641
C  -1.611604 -2.803419 0.673724
C  -6.367704 -0.488021 1.112707
H  3.626694 0.77656 0.926216
H  3.464898 1.809209 -1.310177
H  2.190054 0.702615 -1.76072
H  1.469985 -1.16392 -0.00906
H  2.297233 -1.207904 1.52913
H  1.252105 2.875119 -1.071823
H  2.097277 2.788435 0.467184
H  1.410477 0.983572 2.16288
H  0.100137 -0.118094 1.763887
H  -1.602906 2.088969 -1.578338
H  -2.17214 1.286068 1.305258
H  -2.399071 2.869348 0.532102
H  5.22105 0.703863 -1.784112
H  5.810472 0.761133 -0.123933
H  6.285081 -0.557085 -1.190798
H  3.992276 -2.387078 0.989082
H  5.06181 -1.106119 1.557843
H  5.61371 -2.24732 0.335085
H  4.559207 -2.245114 -1.966037
H  2.925096 -2.237213 -1.322969
H  3.436514 -0.987496 -2.454895
H  -2.435522 -0.091325 -2.162881
H  -3.579462 0.834133 -1.235139
H  -4.733441 -1.251991 -0.891557
H  -4.213122 -2.112232 0.540401
H  -2.505072 -2.598366 -1.277048
H  -1.068975 -1.635101 -1.020554
H  -4.809598 0.874477 0.547775
H  -4.406039 -0.122003 1.929042
H  -1.040948 -2.212708 1.392074
H  -2.48277 -3.206712 1.192553
H  -0.995574 -3.651922 0.371894
H  -6.886624 -0.476779 0.151915
H  -6.876399 0.221445 1.766526
H  -6.499123 -1.48253 1.544105
elementType: O N C H
totalener: -912.31459079 hartree
nucrepener: 1922.45517594 hartree
electener: -2834.76976672 hartree
oneelecener: -5058.71262370 hartree
twoeener: 2223.94285698 hartree
cpcmener: -0.01506382 hartree
kineticenergy: 907.79365748 hartree
xcener: -92.069049188532 hartree
chargesum: 0.0000000
charge: -0.420913 -0.399687 -0.229428 0.098962 0.601376 -0.226004 -0.258263 0.264121 -0.277435 -0.289273 0.201357 -0.019136 -0.358083 -0.361510 -0.375515 -0.132920 -0.096430 -0.085478 -0.073781 -0.275064 -0.283442 0.057795 0.088842 0.076594 0.085066 0.090233 0.079099 0.084268 0.089129 0.088637 0.066843 0.069746 0.103741 0.093825 0.098417 0.094573 0.094432 0.098620 0.095292 0.097659 0.094923 0.096710 0.095689 0.100683 0.073025 0.091653 0.077005 0.091919 0.059289 0.055116 0.073572 0.089288 0.093706 0.079030 0.091359 0.080768
qa: -0.4209 -0.3997 -0.2294 0.0990 0.6014 -0.2260 -0.2583 0.2641 -0.2774 -0.2893 0.2014 -0.0191 -0.3581 -0.3615 -0.3755 -0.1329 -0.0964 -0.0855 -0.0738 -0.2751 -0.2834 0.0578 0.0888 0.0766 0.0851 0.0902 0.0791 0.0843 0.0891 0.0886 0.0668 0.0697 0.1037 0.0938 0.0984 0.0946 0.0944 0.0986 0.0953 0.0977 0.0949 0.0967 0.0957 0.1007 0.0730 0.0917 0.0770 0.0919 0.0593 0.0551 0.0736 0.0893 0.0937 0.0790 0.0914 0.0808
va: 1.9868 2.0008 2.8022 3.6869 3.7253 3.9202 3.9553 3.6701 4.0711 4.0163 3.9016 3.9702 3.9225 3.9245 3.9458 3.9076 3.9077 3.8843 3.8378 3.9303 3.9672 1.0170 1.0135 1.0212 0.9980 1.0120 1.0205 1.0170 1.0245 1.0166 1.0060 1.0239 0.9955 1.0002 1.0029 1.0069 0.9986 1.0027 1.0068 1.0046 1.0018 1.0003 1.0089 1.0000 1.0037 0.9965 1.0066 1.0014 1.0113 1.0150 1.0059 1.0040 1.0078 1.0016 1.0034 1.0000
dispcorr: -0.030181906 hartree
energy: -912.344772693960
dipole: 2.09069 -2.73103 -0.64034 -12.92244 12.65630 -0.26614 -0.06362 -0.32118 -0.38480
magnitude: 0.79305 au
magnitude: 2.01578 debye
