program: Orca
programVersion: 5.0.2
elementType: O O N C C C C C C C C C C C C C C C C C C H H H H H H H H H H H H H H H H H H H H H H H H H H H H H H H H H H H
charge: 0
multiplicity: 1
keywords: wb97x-d3
keywords: def2-TZVPP
keywords: def2/J RIJCOSX
keywords: DEFGRID2
keywords: scfconv7
keywords: smallprint printgap noloewdin
keywords: NOSOSCF
formula: C18H35NO2
InChI: InChI=1/C18H35NO2/c1-6-12-19(7-2)13-16-14-20-18(21-16)10-8-15(9-11-18)17(3,4)5/h15-16H,6-14H2,1-5H3
56 atoms
O  -0.034833 0.733942 -0.739742
O  -0.396867 1.971297 1.094978
N  -3.451103 -0.653575 -0.496891
C  3.395178 0.221692 0.197237
C  0.594572 1.227166 0.430972
C  2.864798 1.376039 -0.659414
C  2.229083 -0.691575 0.589713
C  4.590952 -0.537759 -0.437099
C  1.740906 2.13969 0.036832
C  1.111455 0.075369 1.290402
C  -1.44152 0.730463 -0.554869
C  -1.629033 1.328488 0.841908
C  5.175732 -1.519926 0.583009
C  4.183346 -1.316826 -1.689788
C  5.700075 0.44959 -0.812811
C  -2.011778 -0.672939 -0.681878
C  -3.950983 -1.883489 0.100635
C  -4.167803 -0.291957 -1.712043
C  -3.792683 -1.921614 1.615129
C  -5.492774 0.390475 -1.423587
C  -4.638947 -0.878533 2.328314
H  3.780891 0.669545 1.125352
H  3.662079 2.086035 -0.884627
H  2.508865 1.000238 -1.623361
H  1.82445 -1.186298 -0.298261
H  2.568555 -1.487989 1.254342
H  1.365914 2.939625 -0.607475
H  2.131432 2.614527 0.942283
H  1.487122 0.492541 2.229989
H  0.296466 -0.606579 1.551995
H  -1.88509 1.385921 -1.313322
H  -1.841988 0.552727 1.588527
H  -2.427514 2.068777 0.888047
H  6.069503 -2.004368 0.182578
H  5.466263 -1.010807 1.505717
H  4.477306 -2.314015 0.850218
H  3.729982 -0.675237 -2.448128
H  3.474344 -2.11596 -1.466799
H  5.057679 -1.785436 -2.148149
H  5.972682 1.08974 0.030468
H  6.601653 -0.086426 -1.118693
H  5.420511 1.098628 -1.643997
H  -1.557125 -1.294934 0.093761
H  -1.721488 -1.118706 -1.646298
H  -5.015233 -1.976043 -0.130664
H  -3.470167 -2.766748 -0.348736
H  -3.549975 0.394984 -2.294008
H  -4.326273 -1.168953 -2.359513
H  -2.739997 -1.798095 1.888178
H  -4.073287 -2.920232 1.961369
H  -6.167447 -0.23903 -0.840913
H  -5.33627 1.316428 -0.868149
H  -6.00492 0.638765 -2.354727
H  -4.486933 -0.912137 3.408262
H  -5.703333 -1.040723 2.143813
H  -4.399966 0.131147 1.993031
elementType: O N C H
totalener: -912.31494826 hartree
nucrepener: 1893.33343268 hartree
electener: -2805.64838095 hartree
oneelecener: -4999.99668564 hartree
twoeener: 2194.34830469 hartree
cpcmener: -0.01539756 hartree
kineticenergy: 907.79654023 hartree
xcener: -92.069192021473 hartree
chargesum: -0.0000000
charge: -0.428278 -0.391811 -0.240296 0.091836 0.580260 -0.214957 -0.247513 0.258197 -0.271764 -0.298438 0.257616 -0.023889 -0.358404 -0.374206 -0.357914 -0.204247 -0.097716 -0.044799 -0.096378 -0.267814 -0.282660 0.055155 0.086230 0.076327 0.083659 0.088472 0.078354 0.084074 0.086425 0.088845 0.084772 0.079107 0.102403 0.095029 0.096768 0.094601 0.099278 0.093393 0.097371 0.099046 0.094437 0.094027 0.105015 0.088713 0.092646 0.087188 0.079332 0.070949 0.058117 0.073448 0.079902 0.074512 0.092925 0.097409 0.084012 0.071234
qa: -0.4283 -0.3918 -0.2403 0.0918 0.5803 -0.2150 -0.2475 0.2582 -0.2718 -0.2984 0.2576 -0.0239 -0.3584 -0.3742 -0.3579 -0.2042 -0.0977 -0.0448 -0.0964 -0.2678 -0.2827 0.0552 0.0862 0.0763 0.0837 0.0885 0.0784 0.0841 0.0864 0.0888 0.0848 0.0791 0.1024 0.0950 0.0968 0.0946 0.0993 0.0934 0.0974 0.0990 0.0944 0.0940 0.1050 0.0887 0.0926 0.0872 0.0793 0.0709 0.0581 0.0734 0.0799 0.0745 0.0929 0.0974 0.0840 0.0712
va: 1.9910 2.0204 2.7591 3.6824 3.7825 3.9073 3.9480 3.6748 4.0562 4.0192 3.7443 3.9928 3.9229 3.9464 3.9249 4.0098 3.9007 3.8904 3.8569 3.9278 3.9164 1.0174 1.0126 1.0229 1.0145 1.0141 1.0297 1.0161 1.0225 1.0127 1.0024 1.0038 0.9940 1.0060 1.0035 1.0015 1.0010 0.9997 1.0048 1.0022 1.0076 0.9976 0.9895 1.0165 0.9924 1.0099 0.9959 1.0054 1.0093 1.0151 1.0022 1.0089 1.0106 1.0049 1.0021 1.0135
dispcorr: -0.029505450 hartree
energy: -912.344453714723
dipole: 1.14199 -1.55278 -0.41079 -9.66987 8.87133 -0.79854 -0.53967 0.46664 -0.07303
magnitude: 0.90097 au
magnitude: 2.29008 debye
