program: Orca
programVersion: 5.0.2
elementType: O O N C C C C C C C C C C C C C C C C C C H H H H H H H H H H H H H H H H H H H H H H H H H H H H H H H H H H H
charge: 0
multiplicity: 1
keywords: wb97x-d3
keywords: def2-TZVPP
keywords: def2/J RIJCOSX
keywords: DEFGRID2
keywords: scfconv7
keywords: smallprint printgap noloewdin
keywords: NOSOSCF
formula: C18H35NO2
InChI: InChI=1/C18H35NO2/c1-6-12-19(7-2)13-16-14-20-18(21-16)10-8-15(9-11-18)17(3,4)5/h15-16H,6-14H2,1-5H3
56 atoms
O  -0.258183 0.656273 -0.634438
O  -0.416555 2.336619 0.872901
N  -2.840612 -0.782591 -0.123846
C  3.209362 0.203021 0.128304
C  0.48192 1.396472 0.318901
C  2.658215 1.163553 -0.930473
C  2.043273 -0.531263 0.798929
C  4.326282 -0.73492 -0.403591
C  1.630815 2.133372 -0.353546
C  1.014562 0.439032 1.375362
C  -1.535102 1.24351 -0.804885
C  -1.732805 1.96211 0.516475
C  3.840805 -1.627494 -1.547001
C  5.507803 0.103232 -0.902528
C  4.840034 -1.627791 0.730332
C  -2.58976 0.208454 -1.154544
C  -4.256397 -1.099716 -0.008328
C  -2.021678 -1.979262 -0.273197
C  -5.061773 -0.02722 0.712174
C  -1.794053 -2.705485 1.040651
C  -6.548108 -0.350597 0.726448
H  3.681356 0.821893 0.906033
H  3.464149 1.7462 -1.379974
H  2.199861 0.597592 -1.746784
H  1.555452 -1.200731 0.083393
H  2.403434 -1.165159 1.610659
H  1.241349 2.788333 -1.138707
H  2.112762 2.778717 0.387771
H  1.479412 1.029656 2.170893
H  0.183651 -0.11034 1.8290
H  -1.507336 1.973154 -1.627397
H  -2.181079 1.302269 1.266636
H  -2.348425 2.8584 0.426369
H  4.644512 -2.288292 -1.8809
H  3.005931 -2.264976 -1.249158
H  3.521926 -1.05025 -2.416738
H  5.262475 0.691583 -1.787954
H  6.349233 -0.539286 -1.172506
H  5.859764 0.795204 -0.132974
H  5.718412 -2.191012 0.406386
H  5.134644 -1.038959 1.603144
H  4.098795 -2.357791 1.058494
H  -2.331931 -0.255685 -2.117994
H  -3.504367 0.774641 -1.346564
H  -4.70479 -1.29573 -0.997583
H  -4.35954 -2.031505 0.552498
H  -2.456028 -2.674092 -1.010377
H  -1.052074 -1.688657 -0.674361
H  -4.911583 0.947444 0.2387
H  -4.689589 0.068041 1.73577
H  -2.72162 -3.063953 1.489793
H  -1.153773 -3.575463 0.885573
H  -1.303027 -2.053847 1.765616
H  -6.746722 -1.304719 1.219034
H  -6.950776 -0.415518 -0.286471
H  -7.117416 0.414608 1.255432
elementType: O N C H
totalener: -912.31420428 hartree
nucrepener: 1916.42244840 hartree
electener: -2828.73665268 hartree
oneelecener: -5046.60129046 hartree
twoeener: 2217.86463779 hartree
cpcmener: -0.01479879 hartree
kineticenergy: 907.79789120 hartree
xcener: -92.069655240703 hartree
chargesum: -0.0000000
charge: -0.420582 -0.401411 -0.226097 0.097189 0.594121 -0.229918 -0.255296 0.263115 -0.275609 -0.284647 0.198140 -0.011710 -0.375599 -0.357386 -0.360835 -0.136310 -0.101941 -0.083767 -0.071473 -0.270121 -0.281973 0.058059 0.089205 0.077212 0.087273 0.088280 0.080351 0.084221 0.089720 0.091762 0.067225 0.066323 0.100329 0.097575 0.095812 0.096108 0.093956 0.094540 0.097999 0.095170 0.098772 0.094022 0.095726 0.103118 0.073647 0.093423 0.074761 0.091400 0.059024 0.054876 0.087361 0.091646 0.072340 0.080458 0.079066 0.091348
qa: -0.4206 -0.4014 -0.2261 0.0972 0.5941 -0.2299 -0.2553 0.2631 -0.2756 -0.2846 0.1981 -0.0117 -0.3756 -0.3574 -0.3608 -0.1363 -0.1019 -0.0838 -0.0715 -0.2701 -0.2820 0.0581 0.0892 0.0772 0.0873 0.0883 0.0804 0.0842 0.0897 0.0918 0.0672 0.0663 0.1003 0.0976 0.0958 0.0961 0.0940 0.0945 0.0980 0.0952 0.0988 0.0940 0.0957 0.1031 0.0736 0.0934 0.0748 0.0914 0.0590 0.0549 0.0874 0.0916 0.0723 0.0805 0.0791 0.0913
va: 1.9858 1.9977 2.8132 3.6796 3.7384 3.9234 3.9550 3.6702 4.0672 4.0168 3.9061 3.9630 3.9463 3.9223 3.9247 3.9144 3.9110 3.8915 3.8364 3.9276 3.9643 1.0168 1.0137 1.0208 0.9981 1.0132 1.0190 1.0177 1.0230 1.0145 1.0059 1.0307 0.9953 1.0046 1.0017 1.0000 1.0007 1.0068 1.0031 1.0070 1.0027 0.9982 1.0105 0.9991 1.0038 0.9957 1.0065 1.0002 1.0121 1.0157 1.0038 1.0079 1.0088 1.0001 1.0018 1.0034
dispcorr: -0.029952977 hartree
energy: -912.344157252466
dipole: 1.78915 -2.37664 -0.58749 -12.34006 12.07907 -0.26098 -0.24876 -0.20028 -0.44903
magnitude: 0.78415 au
magnitude: 1.99315 debye
