program: Orca
programVersion: 5.0.2
elementType: O O N C C C C C C C C C C C C C C C C C C H H H H H H H H H H H H H H H H H H H H H H H H H H H H H H H H H H H
charge: 0
multiplicity: 1
keywords: wb97x-d3
keywords: def2-TZVPP
keywords: def2/J RIJCOSX
keywords: DEFGRID2
keywords: scfconv7
keywords: smallprint printgap noloewdin
keywords: NOSOSCF
formula: C18H35NO2
InChI: InChI=1/C18H35NO2/c1-6-12-19(7-2)13-16-14-20-18(21-16)10-8-15(9-11-18)17(3,4)5/h15-16H,6-14H2,1-5H3
56 atoms
O  -0.390743 0.726858 -0.264498
O  -0.220046 2.830361 0.513211
N  -3.066469 -1.029896 0.023137
C  3.16109 0.279296 -0.080479
C  0.543727 1.691318 0.191815
C  2.386902 0.823348 -1.286427
C  2.18037 -0.034486 1.054098
C  4.107418 -0.900832 -0.430037
C  1.51631 2.023706 -0.924128
C  1.302806 1.162211 1.405606
C  -1.711619 1.129185 0.072216
C  -1.483034 2.365769 0.934843
C  3.347077 -2.119091 -0.958685
C  5.120719 -0.455772 -1.489586
C  4.898819 -1.320291 0.813094
C  -2.485578 0.03857 0.809991
C  -4.20716 -0.602285 -0.771306
C  -2.122283 -1.84753 -0.720319
C  -5.466076 -0.354135 0.053742
C  -1.132562 -2.584339 0.164494
C  -5.936384 -1.586637 0.809099
H  3.811128 1.09299 0.274803
H  3.074451 1.130425 -2.076091
H  1.758533 0.038106 -1.717063
H  1.545593 -0.881645 0.779164
H  2.717834 -0.337707 1.954145
H  0.962356 2.37081 -1.80083
H  2.152933 2.851976 -0.597621
H  1.929426 1.971044 1.794919
H  0.604846 0.892321 2.204002
H  -2.236157 1.410203 -0.849302
H  -1.488813 2.118238 2.005245
H  -2.227232 3.144373 0.765006
H  4.042227 -2.928999 -1.193216
H  2.635613 -2.512121 -0.22965
H  2.793854 -1.898991 -1.873612
H  4.657028 -0.251124 -2.455511
H  5.869658 -1.233573 -1.656284
H  5.652523 0.4477 -1.179986
H  5.425816 -0.472312 1.258551
H  4.266705 -1.759365 1.586173
H  5.649262 -2.071016 0.5544
H  -3.298865 0.528156 1.353839
H  -1.834446 -0.377827 1.585058
H  -3.991461 0.290659 -1.378857
H  -4.429455 -1.396529 -1.488975
H  -2.706734 -2.595291 -1.262168
H  -1.574432 -1.28451 -1.491517
H  -6.248769 -0.020753 -0.633378
H  -5.317312 0.475871 0.750345
H  -0.451048 -1.915695 0.689376
H  -1.648352 -3.192679 0.909258
H  -0.520162 -3.250958 -0.444711
H  -6.130011 -2.416726 0.125655
H  -6.859928 -1.391199 1.356071
H  -5.191458 -1.924072 1.529602
elementType: O N C H
totalener: -912.31276379 hartree
nucrepener: 1923.67692231 hartree
electener: -2835.98968611 hartree
oneelecener: -5060.85295595 hartree
twoeener: 2224.86326984 hartree
cpcmener: -0.01574000 hartree
kineticenergy: 907.78961303 hartree
xcener: -92.072878394973 hartree
chargesum: 0.0000000
charge: -0.397755 -0.387222 -0.215456 0.100299 0.562844 -0.220091 -0.245587 0.266593 -0.273328 -0.278547 0.179372 -0.017607 -0.379998 -0.357035 -0.363069 -0.217699 -0.074624 -0.046586 -0.097793 -0.280365 -0.274879 0.057773 0.088978 0.077917 0.070963 0.088715 0.077403 0.083779 0.084798 0.087578 0.088527 0.078072 0.106293 0.099296 0.092830 0.097768 0.094320 0.094463 0.098842 0.098499 0.095199 0.094796 0.113282 0.112010 0.082392 0.084995 0.082530 0.059618 0.068727 0.059926 0.075486 0.088145 0.091974 0.077934 0.091156 0.073551
qa: -0.3978 -0.3872 -0.2155 0.1003 0.5628 -0.2201 -0.2456 0.2666 -0.2733 -0.2785 0.1794 -0.0176 -0.3800 -0.3570 -0.3631 -0.2177 -0.0746 -0.0466 -0.0978 -0.2804 -0.2749 0.0578 0.0890 0.0779 0.0710 0.0887 0.0774 0.0838 0.0848 0.0876 0.0885 0.0781 0.1063 0.0993 0.0928 0.0978 0.0943 0.0945 0.0988 0.0985 0.0952 0.0948 0.1133 0.1120 0.0824 0.0850 0.0825 0.0596 0.0687 0.0599 0.0755 0.0881 0.0920 0.0779 0.0912 0.0736
va: 1.9692 2.0185 2.8792 3.6790 3.7882 3.9181 3.9883 3.6740 4.0503 4.0219 3.7635 4.0024 3.9499 3.9186 3.9233 4.0434 3.8988 3.8876 3.8393 3.9117 3.9310 1.0170 1.0129 1.0184 1.0036 1.0156 1.0281 1.0165 1.0222 1.0127 1.0062 0.9988 0.9943 1.0059 1.0005 1.0000 0.9995 1.0071 1.0028 1.0027 0.9985 1.0070 0.9927 0.9942 1.0111 0.9974 0.9964 1.0044 1.0132 1.0070 0.9978 1.0139 1.0071 1.0013 1.0064 1.0192
dispcorr: -0.030415372 hartree
energy: -912.343179166460
dipole: 3.27104 -3.54034 -0.26929 -14.29726 14.37967 0.08240 -0.70995 0.83907 0.12911
magnitude: 0.30981 au
magnitude: 0.78747 debye
