program: Orca
programVersion: 5.0.2
elementType: O O N C C C C C C C C C C C C C C C C C C H H H H H H H H H H H H H H H H H H H H H H H H H H H H H H H H H H H
charge: 0
multiplicity: 1
keywords: wb97x-d3
keywords: def2-TZVPP
keywords: def2/J RIJCOSX
keywords: DEFGRID2
keywords: scfconv7
keywords: smallprint printgap noloewdin
keywords: NOSOSCF
formula: C18H35NO2
InChI: InChI=1/C18H35NO2/c1-6-12-19(7-2)13-16-14-20-18(21-16)10-8-15(9-11-18)17(3,4)5/h15-16H,6-14H2,1-5H3
56 atoms
O  -0.004673 0.519189 -0.738062
O  -0.291848 2.25648 0.645243
N  -3.411759 -0.662502 0.072032
C  3.418395 0.173693 0.324999
C  0.659249 1.306681 0.234175
C  2.930423 1.042007 -0.839573
C  2.218996 -0.541996 0.954142
C  4.590615 -0.775747 -0.041357
C  1.835841 2.015272 -0.410886
C  1.138652 0.439431 1.396244
C  -1.405268 0.58399 -0.517897
C  -1.557324 1.629957 0.592333
C  5.138674 -1.429771 1.23069
C  4.165504 -1.876383 -1.015628
C  5.732508 0.023824 -0.676721
C  -1.979486 -0.771402 -0.130617
C  -4.178164 -0.728574 -1.162699
C  -3.919522 -1.525653 1.125255
C  -5.483388 0.056172 -1.112082
C  -3.736438 -3.026957 0.921232
C  -5.28485 1.547819 -0.894421
H  3.816273 0.861771 1.086105
H  3.752993 1.625352 -1.255917
H  2.560524 0.411141 -1.653899
H  1.789844 -1.253001 0.241692
H  2.528354 -1.127674 1.821547
H  1.486013 2.598636 -1.267066
H  2.246454 2.725555 0.313344
H  1.538085 1.097883 2.174368
H  0.30032 -0.102155 1.844016
H  -1.872933 0.934754 -1.444441
H  -1.818929 1.165314 1.55103
H  -2.310914 2.385356 0.36889
H  6.017615 -2.037951 1.004255
H  5.441927 -0.679215 1.965234
H  4.413419 -2.087825 1.711557
H  3.426714 -2.551863 -0.58069
H  5.026584 -2.486131 -1.300044
H  3.741553 -1.472045 -1.936958
H  6.020446 0.87822 -0.058176
H  6.618577 -0.603886 -0.796929
H  5.476849 0.403518 -1.667011
H  -1.512378 -1.086753 0.806824
H  -1.706221 -1.525584 -0.883686
H  -3.569607 -0.3131 -1.969985
H  -4.388854 -1.766466 -1.461735
H  -3.436114 -1.234111 2.062178
H  -4.981998 -1.309779 1.262831
H  -6.143832 -0.347918 -0.339517
H  -6.00372 -0.108334 -2.059986
H  -4.227829 -3.386459 0.0160
H  -2.682692 -3.305784 0.862726
H  -4.169462 -3.572611 1.761493
H  -4.841366 1.761021 0.078208
H  -6.234547 2.083182 -0.943374
H  -4.631587 1.976109 -1.658315
elementType: O N C H
totalener: -912.31336993 hartree
nucrepener: 1888.56643003 hartree
electener: -2800.87979996 hartree
oneelecener: -4990.53040436 hartree
twoeener: 2189.65060440 hartree
cpcmener: -0.01557486 hartree
kineticenergy: 907.79739427 hartree
xcener: -92.072513021217 hartree
chargesum: -0.0000000
charge: -0.429230 -0.391111 -0.228330 0.087086 0.574509 -0.214724 -0.243924 0.258889 -0.267154 -0.306358 0.264889 -0.025863 -0.357873 -0.372285 -0.359581 -0.205969 -0.098271 -0.052285 -0.094627 -0.275754 -0.280539 0.055437 0.087094 0.076929 0.083451 0.089210 0.078170 0.083456 0.087072 0.094894 0.080819 0.079442 0.096817 0.094306 0.096823 0.094818 0.093338 0.097409 0.098309 0.099442 0.094586 0.093862 0.104677 0.089136 0.092368 0.085819 0.073475 0.081211 0.059625 0.066684 0.083753 0.081334 0.094378 0.073091 0.097983 0.079285
qa: -0.4292 -0.3911 -0.2283 0.0871 0.5745 -0.2147 -0.2439 0.2589 -0.2672 -0.3064 0.2649 -0.0259 -0.3579 -0.3723 -0.3596 -0.2060 -0.0983 -0.0523 -0.0946 -0.2758 -0.2805 0.0554 0.0871 0.0769 0.0835 0.0892 0.0782 0.0835 0.0871 0.0949 0.0808 0.0794 0.0968 0.0943 0.0968 0.0948 0.0933 0.0974 0.0983 0.0994 0.0946 0.0939 0.1047 0.0891 0.0924 0.0858 0.0735 0.0812 0.0596 0.0667 0.0838 0.0813 0.0944 0.0731 0.0980 0.0793
va: 1.9943 2.0154 2.8132 3.6834 3.7926 3.9074 3.9465 3.6734 4.0483 4.0101 3.7804 3.9804 3.9237 3.9463 3.9253 3.9955 3.9227 3.9539 3.8491 3.9067 3.9295 1.0173 1.0125 1.0219 1.0145 1.0136 1.0307 1.0169 1.0230 1.0113 1.0070 1.0036 0.9915 1.0065 1.0033 1.0014 0.9999 1.0047 1.0013 1.0022 1.0073 0.9980 0.9874 1.0073 0.9936 1.0083 0.9976 0.9946 1.0070 1.0141 1.0022 0.9996 1.0097 1.0119 1.0074 0.9998
dispcorr: -0.029331907 hartree
energy: -912.342701840769
dipole: 1.47571 -1.97259 -0.49689 -10.84625 10.02930 -0.81695 -0.20370 0.44255 0.23885
magnitude: 0.98557 au
magnitude: 2.50513 debye
