program: Orca
programVersion: 5.0.2
elementType: O O N C C C C C C C C C C C C C C C C C C H H H H H H H H H H H H H H H H H H H H H H H H H H H H H H H H H H H
charge: 0
multiplicity: 1
keywords: wb97x-d3
keywords: def2-TZVPP
keywords: def2/J RIJCOSX
keywords: DEFGRID2
keywords: scfconv7
keywords: smallprint printgap noloewdin
keywords: NOSOSCF
formula: C18H35NO2
InChI: InChI=1/C18H35NO2/c1-6-12-19(7-2)13-16-14-20-18(21-16)10-8-15(9-11-18)17(3,4)5/h15-16H,6-14H2,1-5H3
56 atoms
O  -0.045322 0.436333 -0.814552
O  -0.300328 2.237922 0.491232
N  -3.410422 -0.704285 0.228686
C  3.414773 0.166707 0.206932
C  0.642324 1.269768 0.103106
C  2.899481 0.9713 -0.990799
C  2.232769 -0.53243 0.884668
C  4.595966 -0.779732 -0.135879
C  1.802206 1.954827 -0.596902
C  1.147166 0.457702 1.293767
C  -1.441267 0.519035 -0.565728
C  -1.559987 1.600581 0.513648
C  4.221105 -1.817846 -1.195411
C  5.782935 0.041893 -0.650641
C  5.056533 -1.514734 1.127645
C  -2.0100 -0.822203 -0.119827
C  -4.311201 -0.564115 -0.909452
C  -3.845423 -1.669061 1.223464
C  -4.85898 0.850039 -1.088082
C  -3.775771 -3.136664 0.810284
C  -5.648391 1.343694 0.114521
H  3.812809 0.891723 0.93304
H  3.710188 1.536303 -1.453149
H  2.518844 0.29573 -1.762426
H  1.806407 -1.287536 0.216822
H  2.560671 -1.064567 1.778387
H  1.432812 2.487978 -1.477285
H  2.213503 2.706999 0.0834
H  1.549662 1.153169 2.037119
H  0.320814 -0.072687 1.775436
H  -1.924896 0.839401 -1.4949
H  -1.776824 1.165741 1.496719
H  -2.330698 2.340529 0.297289
H  3.950743 -1.358453 -2.147949
H  5.066199 -2.482788 -1.390632
H  3.385026 -2.446385 -0.882425
H  6.066804 0.822149 0.060576
H  5.576984 0.525114 -1.606796
H  6.656989 -0.59659 -0.800019
H  5.975194 -2.073896 0.933422
H  5.264999 -0.817698 1.943987
H  4.318162 -2.233348 1.486637
H  -1.458988 -1.144107 0.768686
H  -1.823724 -1.576703 -0.899989
H  -3.816226 -0.88165 -1.835779
H  -5.161583 -1.242883 -0.787035
H  -3.243833 -1.523184 2.125382
H  -4.871761 -1.422372 1.507023
H  -5.499307 0.855184 -1.975356
H  -4.041886 1.544543 -1.301128
H  -2.75239 -3.452613 0.600127
H  -4.154661 -3.774069 1.611381
H  -4.376982 -3.337789 -0.078601
H  -6.020114 2.357404 -0.044026
H  -5.032882 1.358347 1.015198
H  -6.513844 0.707446 0.31358
elementType: O N C H
totalener: -912.31182884 hartree
nucrepener: 1891.72627457 hartree
electener: -2804.03810341 hartree
oneelecener: -4996.81252854 hartree
twoeener: 2192.77442513 hartree
cpcmener: -0.01540760 hartree
kineticenergy: 907.78977355 hartree
xcener: -92.070149802766 hartree
chargesum: 0.0000000
charge: -0.432048 -0.391826 -0.221478 0.087716 0.581185 -0.218289 -0.239831 0.263038 -0.265818 -0.309760 0.257611 -0.020192 -0.374228 -0.357786 -0.363306 -0.216335 -0.095703 -0.051260 -0.103510 -0.271561 -0.280759 0.055551 0.088353 0.077781 0.081256 0.087786 0.078331 0.083585 0.086834 0.095052 0.087561 0.077119 0.096717 0.095403 0.097241 0.097052 0.097758 0.094846 0.094499 0.094936 0.099820 0.093806 0.105344 0.082774 0.091063 0.088921 0.073178 0.078073 0.071616 0.058081 0.083726 0.094482 0.080510 0.095082 0.075496 0.084502
qa: -0.4320 -0.3918 -0.2215 0.0877 0.5812 -0.2183 -0.2398 0.2630 -0.2658 -0.3098 0.2576 -0.0202 -0.3742 -0.3578 -0.3633 -0.2163 -0.0957 -0.0513 -0.1035 -0.2716 -0.2808 0.0556 0.0884 0.0778 0.0813 0.0878 0.0783 0.0836 0.0868 0.0951 0.0876 0.0771 0.0967 0.0954 0.0972 0.0971 0.0978 0.0948 0.0945 0.0949 0.0998 0.0938 0.1053 0.0828 0.0911 0.0889 0.0732 0.0781 0.0716 0.0581 0.0837 0.0945 0.0805 0.0951 0.0755 0.0845
va: 1.9925 2.0171 2.8013 3.6854 3.7809 3.9120 3.9432 3.6683 4.0489 4.0115 3.7718 3.9799 3.9466 3.9216 3.9265 4.0329 3.8901 3.9400 3.8610 3.9064 3.9151 1.0172 1.0133 1.0201 1.0170 1.0131 1.0302 1.0175 1.0229 1.0094 1.0022 1.0068 0.9939 1.0001 1.0043 1.0011 1.0030 1.0009 1.0067 1.0071 1.0023 0.9983 0.9881 1.0084 1.0056 0.9970 0.9989 0.9935 1.0162 1.0122 0.9996 1.0100 1.0035 1.0064 1.0126 1.0011
dispcorr: -0.029530319 hartree
energy: -912.341359158681
dipole: 1.24611 -1.73987 -0.49377 -10.65858 9.88897 -0.76961 1.04593 -0.80462 0.24132
magnitude: 0.94569 au
magnitude: 2.40376 debye
