program: Orca
programVersion: 5.0.2
elementType: O O N C C C C C C C C C C C C C C C C C C H H H H H H H H H H H H H H H H H H H H H H H H H H H H H H H H H H H
charge: 0
multiplicity: 1
keywords: wb97x-d3
keywords: def2-TZVPP
keywords: def2/J RIJCOSX
keywords: DEFGRID2
keywords: scfconv7
keywords: smallprint printgap noloewdin
keywords: NOSOSCF
formula: C18H35NO2
InChI: InChI=1/C18H35NO2/c1-6-12-19(7-2)13-16-14-20-18(21-16)10-8-15(9-11-18)17(3,4)5/h15-16H,6-14H2,1-5H3
56 atoms
O  -0.009088 0.188027 -0.683745
O  -0.41509 1.38361 1.186267
N  -3.634395 -0.432983 -0.318189
C  3.525816 0.22911 0.059791
C  0.622613 0.812192 0.426849
C  2.784238 1.24574 -0.813605
C  2.530035 -0.838104 0.524904
C  4.813583 -0.344416 -0.588001
C  1.603611 1.867629 -0.072986
C  1.346897 -0.225001 1.268573
C  -1.391622 0.510678 -0.693528
C  -1.478713 1.659773 0.298337
C  4.517251 -1.156132 -1.84945
C  5.765348 0.800437 -0.951306
C  5.541522 -1.242308 0.417353
C  -2.210687 -0.705415 -0.273026
C  -4.37027 -1.182405 0.688977
C  -4.185724 -0.598377 -1.65568
C  -4.269692 -0.572047 2.080522
C  -5.440987 0.22585 -1.88152
C  -4.996708 -1.404864 3.12496
H  3.858541 0.767647 0.959941
H  3.452217 2.050214 -1.125732
H  2.430383 0.767544 -1.732166
H  2.162374 -1.410068 -0.332528
H  3.012395 -1.55829 1.187797
H  1.088921 2.587094 -0.716783
H  1.975287 2.424584 0.792993
H  1.704314 0.261196 2.181703
H  0.642741 -1.003404 1.576331
H  -1.671667 0.833213 -1.700947
H  -2.415992 1.677319 0.854179
H  -1.354748 2.631292 -0.194688
H  5.445213 -1.52798 -2.290871
H  3.890659 -2.026047 -1.64333
H  4.015539 -0.560868 -2.614916
H  5.948497 1.455314 -0.095332
H  5.388372 1.419364 -1.766617
H  6.73253 0.407394 -1.273081
H  6.505799 -1.564387 0.017234
H  5.737603 -0.714823 1.354735
H  4.980858 -2.146517 0.65887
H  -1.9256 -0.967408 0.749121
H  -1.932785 -1.569512 -0.897313
H  -5.425062 -1.204728 0.405407
H  -4.047327 -2.236745 0.720152
H  -3.43484 -0.278469 -2.381253
H  -4.385378 -1.658393 -1.881763
H  -4.68776 0.437876 2.05217
H  -3.221804 -0.46223 2.374798
H  -5.239853 1.287077 -1.72755
H  -5.80085 0.096804 -2.903505
H  -6.255935 -0.06077 -1.214995
H  -4.579025 -2.411369 3.195302
H  -6.058145 -1.505857 2.889154
H  -4.923665 -0.951931 4.114519
elementType: O N C H
totalener: -912.31621672 hartree
nucrepener: 1870.79208308 hartree
electener: -2783.10829981 hartree
oneelecener: -4955.12778668 hartree
twoeener: 2172.01948687 hartree
cpcmener: -0.01487570 hartree
kineticenergy: 907.79742675 hartree
xcener: -92.067620111014 hartree
chargesum: 0.0000000
charge: -0.434130 -0.401047 -0.247521 0.082623 0.561475 -0.226063 -0.223168 0.260334 -0.275306 -0.273071 0.266476 -0.014375 -0.371893 -0.359213 -0.357729 -0.220046 -0.095303 -0.047126 -0.067669 -0.261287 -0.281868 0.056397 0.087463 0.077396 0.078909 0.088476 0.083246 0.080035 0.086550 0.082830 0.091827 0.096416 0.089831 0.097261 0.095432 0.096640 0.098784 0.093627 0.094578 0.094271 0.098309 0.094100 0.112667 0.090941 0.093343 0.075885 0.082553 0.069524 0.051901 0.055314 0.071831 0.089208 0.079947 0.078885 0.080146 0.091387
qa: -0.4341 -0.4010 -0.2475 0.0826 0.5615 -0.2261 -0.2232 0.2603 -0.2753 -0.2731 0.2665 -0.0144 -0.3719 -0.3592 -0.3577 -0.2200 -0.0953 -0.0471 -0.0677 -0.2613 -0.2819 0.0564 0.0875 0.0774 0.0789 0.0885 0.0832 0.0800 0.0865 0.0828 0.0918 0.0964 0.0898 0.0973 0.0954 0.0966 0.0988 0.0936 0.0946 0.0943 0.0983 0.0941 0.1127 0.0909 0.0933 0.0759 0.0826 0.0695 0.0519 0.0553 0.0718 0.0892 0.0799 0.0789 0.0801 0.0914
va: 1.9890 1.9929 2.8002 3.6884 3.8101 3.9262 3.9240 3.6702 4.0706 4.0420 3.7837 3.9476 3.9455 3.9253 3.9226 3.9719 3.9105 3.8970 3.8364 3.9296 3.9642 1.0171 1.0126 1.0221 1.0197 1.0139 1.0138 1.0215 1.0182 1.0197 1.0021 1.0148 0.9957 1.0045 1.0001 1.0004 1.0026 0.9992 1.0069 1.0068 1.0029 1.0007 0.9909 1.0207 0.9926 1.0041 0.9908 1.0056 1.0180 1.0146 1.0130 1.0083 1.0032 1.0018 1.0000 1.0035
dispcorr: -0.028163911 hartree
energy: -912.344380634661
dipole: 1.43491 -1.78951 -0.35459 -6.42215 6.31562 -0.10653 -0.87590 0.54751 -0.32839
magnitude: 0.49490 au
magnitude: 1.25793 debye
