program: Orca
programVersion: 5.0.2
elementType: O O N C C C C C C C C C C C C C C C C C C H H H H H H H H H H H H H H H H H H H H H H H H H H H H H H H H H H H
charge: 0
multiplicity: 1
keywords: wb97x-d3
keywords: def2-TZVPP
keywords: def2/J RIJCOSX
keywords: DEFGRID2
keywords: scfconv7
keywords: smallprint printgap noloewdin
keywords: NOSOSCF
formula: C18H35NO2
InChI: InChI=1/C18H35NO2/c1-6-12-19(7-2)13-16-14-20-18(21-16)10-8-15(9-11-18)17(3,4)5/h15-16H,6-14H2,1-5H3
56 atoms
O  0.043983 -0.156953 -0.378581
O  -0.446445 2.036432 -0.153145
N  -3.56733 -0.472777 0.34094
C  3.537147 0.552472 0.15588
C  0.623578 1.121114 -0.151019
C  2.833263 0.494757 -1.203701
C  2.521425 0.226534 1.2556
C  4.839583 -0.289121 0.222631
C  1.626597 1.427137 -1.25809
C  1.308572 1.152187 1.205217
C  -1.348072 -0.021192 -0.61604
C  -1.494939 1.463312 -0.908602
C  4.592287 -1.766219 -0.088427
C  5.858099 0.262065 -0.780319
C  5.462355 -0.17916 1.618307
C  -2.140472 -0.474976 0.605996
C  -4.00385 -1.691889 -0.325548
C  -4.34992 -0.191432 1.536356
C  -5.242204 -1.490981 -1.188353
C  -4.343813 1.27744 1.920999
C  -5.708305 -2.788504 -1.829714
H  3.84742 1.596462 0.31351
H  3.517954 0.770487 -2.007688
H  2.510895 -0.529182 -1.414986
H  2.191659 -0.813656 1.170614
H  2.975794 0.322745 2.24289
H  1.138801 1.36122 -2.235331
H  1.962217 2.462209 -1.139386
H  1.628118 2.179198 1.408109
H  0.589539 0.882194 1.983974
H  -1.614278 -0.626048 -1.488129
H  -2.446674 1.87561 -0.572451
H  -1.388546 1.67759 -1.978755
H  3.849947 -2.210482 0.577684
H  4.250836 -1.921368 -1.11343
H  5.514541 -2.339992 0.031298
H  5.534319 0.146487 -1.815626
H  6.813264 -0.259742 -0.685966
H  6.049433 1.324852 -0.610377
H  6.4546 -0.63597 1.631224
H  5.580018 0.863409 1.925843
H  4.870654 -0.684899 2.382722
H  -1.922965 0.210499 1.429123
H  -1.780305 -1.464168 0.930348
H  -3.19702 -2.04648 -0.97173
H  -4.180627 -2.504049 0.399826
H  -5.383562 -0.487644 1.348813
H  -4.013169 -0.802757 2.389331
H  -5.015812 -0.752997 -1.962451
H  -6.05812 -1.07119 -0.593493
H  -3.340778 1.653924 2.127622
H  -4.775729 1.890678 1.128996
H  -4.936591 1.432549 2.823992
H  -5.985121 -3.529561 -1.077221
H  -4.928494 -3.23028 -2.453601
H  -6.580772 -2.626888 -2.463949
elementType: O N C H
totalener: -912.31651003 hartree
nucrepener: 1866.03061135 hartree
electener: -2778.34712137 hartree
oneelecener: -4945.57994532 hartree
twoeener: 2167.23282395 hartree
cpcmener: -0.01499974 hartree
kineticenergy: 907.79072673 hartree
xcener: -92.066035376726 hartree
chargesum: 0.0000000
charge: -0.431060 -0.400469 -0.245351 0.085164 0.563550 -0.228146 -0.219781 0.258060 -0.273194 -0.274633 0.257181 -0.011626 -0.372538 -0.355867 -0.360563 -0.214810 -0.093689 -0.052654 -0.064351 -0.270319 -0.280471 0.056024 0.088128 0.078038 0.077840 0.085039 0.082355 0.079267 0.087626 0.083429 0.090466 0.094055 0.087666 0.098154 0.094325 0.097267 0.094352 0.094587 0.096749 0.095000 0.099436 0.093903 0.114285 0.089213 0.089528 0.074665 0.086516 0.073521 0.046445 0.056813 0.080459 0.075991 0.095169 0.078851 0.079789 0.090615
qa: -0.4311 -0.4005 -0.2454 0.0852 0.5635 -0.2281 -0.2198 0.2581 -0.2732 -0.2746 0.2572 -0.0116 -0.3725 -0.3559 -0.3606 -0.2148 -0.0937 -0.0527 -0.0644 -0.2703 -0.2805 0.0560 0.0881 0.0780 0.0778 0.0850 0.0824 0.0793 0.0876 0.0834 0.0905 0.0941 0.0877 0.0982 0.0943 0.0973 0.0944 0.0946 0.0967 0.0950 0.0994 0.0939 0.1143 0.0892 0.0895 0.0747 0.0865 0.0735 0.0464 0.0568 0.0805 0.0760 0.0952 0.0789 0.0798 0.0906
va: 1.9892 1.9973 2.8009 3.6870 3.8071 3.9285 3.9255 3.6716 4.0724 4.0336 3.7889 3.9617 3.9458 3.9232 3.9255 3.9616 3.9224 3.8867 3.8531 3.9201 3.9530 1.0171 1.0132 1.0209 1.0203 1.0140 1.0146 1.0215 1.0175 1.0191 1.0033 1.0126 0.9951 1.0011 0.9994 1.0043 1.0015 1.0062 1.0035 1.0074 1.0023 0.9977 0.9893 1.0210 0.9936 1.0054 0.9906 1.0056 1.0202 1.0130 1.0037 1.0104 1.0105 1.0014 1.0004 1.0041
dispcorr: -0.028074218 hartree
energy: -912.344584242961
dipole: 1.57173 -1.94907 -0.37734 -7.87053 7.51407 -0.35646 1.55276 -1.60246 -0.04970
magnitude: 0.52145 au
magnitude: 1.32543 debye
