program: Orca
programVersion: 5.0.2
elementType: O O N C C C C C C C C C C C C C C C C C C H H H H H H H H H H H H H H H H H H H H H H H H H H H H H H H H H H H
charge: 0
multiplicity: 1
keywords: wb97x-d3
keywords: def2-TZVPP
keywords: def2/J RIJCOSX
keywords: DEFGRID2
keywords: scfconv7
keywords: smallprint printgap noloewdin
keywords: NOSOSCF
formula: C18H35NO2
InChI: InChI=1/C18H35NO2/c1-6-12-19(7-2)13-16-14-20-18(21-16)10-8-15(9-11-18)17(3,4)5/h15-16H,6-14H2,1-5H3
56 atoms
O  -0.008028 -0.160276 -0.427505
O  -0.440411 1.987369 0.122989
N  -3.626923 -0.406041 0.276986
C  3.503174 0.375859 0.254005
C  0.604306 1.050879 -0.002473
C  2.820479 0.53784 -1.108063
C  2.46276 -0.087434 1.278734
C  4.785392 -0.498248 0.211269
C  1.631826 1.492135 -1.039606
C  1.268258 0.859691 1.350941
C  -1.396752 0.051093 -0.633543
C  -1.492231 1.564549 -0.721243
C  4.508856 -1.902804 -0.328782
C  5.835941 0.173804 -0.678425
C  5.38556 -0.621131 1.615486
C  -2.205659 -0.530526 0.523788
C  -4.177751 -1.435312 -0.590527
C  -4.407045 -0.168882 1.479571
C  -5.303346 -0.924706 -1.483582
C  -4.347277 -1.254913 2.55045
C  -4.846759 0.111104 -2.498614
H  3.833253 1.377096 0.569416
H  3.523596 0.919042 -1.85074
H  2.484377 -0.435174 -1.478577
H  2.115448 -1.096428 1.035191
H  2.90261 -0.148826 2.275165
H  1.159273 1.581042 -2.02247
H  1.985342 2.491245 -0.765841
H  1.602536 1.837213 1.712445
H  0.531842 0.488961 2.069741
H  -1.685629 -0.425031 -1.575243
H  -2.435289 1.959405 -0.342712
H  -1.358306 1.921963 -1.749353
H  3.747163 -2.427015 0.252006
H  4.178904 -1.888042 -1.369085
H  5.415993 -2.510964 -0.291165
H  6.057587 1.188044 -0.336089
H  5.525374 0.238422 -1.722274
H  6.772537 -0.388483 -0.660444
H  5.525982 0.358317 2.080395
H  4.767861 -1.220895 2.285433
H  6.36511 -1.103013 1.571238
H  -1.957839 0.028175 1.431646
H  -1.885913 -1.568255 0.703313
H  -3.379533 -1.818563 -1.231842
H  -4.533039 -2.305129 -0.018577
H  -4.075116 0.777295 1.917122
H  -5.448373 -0.009654 1.187935
H  -6.11074 -0.513129 -0.870627
H  -5.735487 -1.782405 -2.006795
H  -4.692402 -2.221662 2.180446
H  -3.336302 -1.38853 2.939811
H  -4.985511 -0.984217 3.393505
H  -4.425654 0.992575 -2.013851
H  -5.67529 0.446303 -3.124557
H  -4.081716 -0.296529 -3.16352
elementType: O N C H
totalener: -912.31419071 hartree
nucrepener: 1880.62373651 hartree
electener: -2792.93792722 hartree
oneelecener: -4974.81706756 hartree
twoeener: 2181.87914034 hartree
cpcmener: -0.01445665 hartree
kineticenergy: 907.78833926 hartree
xcener: -92.069888813646 hartree
chargesum: 0.0000000
charge: -0.434306 -0.404285 -0.240211 0.087626 0.558559 -0.227602 -0.222025 0.256817 -0.273336 -0.272189 0.247198 -0.001479 -0.372340 -0.354955 -0.360486 -0.196949 -0.092603 -0.051067 -0.091339 -0.275576 -0.276670 0.056084 0.087791 0.078157 0.077601 0.085416 0.082550 0.078567 0.087013 0.084645 0.092341 0.091490 0.087683 0.098140 0.094105 0.097393 0.096410 0.094213 0.094420 0.099757 0.093866 0.094523 0.099531 0.089469 0.088507 0.088058 0.073765 0.080161 0.057183 0.063955 0.081771 0.081787 0.093736 0.071868 0.097952 0.077311
qa: -0.4343 -0.4043 -0.2402 0.0876 0.5586 -0.2276 -0.2220 0.2568 -0.2733 -0.2722 0.2472 -0.0015 -0.3723 -0.3550 -0.3605 -0.1969 -0.0926 -0.0511 -0.0913 -0.2756 -0.2767 0.0561 0.0878 0.0782 0.0776 0.0854 0.0825 0.0786 0.0870 0.0846 0.0923 0.0915 0.0877 0.0981 0.0941 0.0974 0.0964 0.0942 0.0944 0.0998 0.0939 0.0945 0.0995 0.0895 0.0885 0.0881 0.0738 0.0802 0.0572 0.0640 0.0818 0.0818 0.0937 0.0719 0.0980 0.0773
va: 1.9908 1.9999 2.8003 3.6836 3.8096 3.9287 3.9267 3.6760 4.0753 4.0347 3.8177 3.9478 3.9454 3.9231 3.9256 3.9584 3.9092 3.9542 3.8586 3.9082 3.9213 1.0166 1.0136 1.0203 1.0204 1.0138 1.0147 1.0216 1.0178 1.0166 1.0031 1.0148 0.9940 1.0012 0.9995 1.0047 1.0034 1.0020 1.0063 1.0021 0.9976 1.0074 1.0000 1.0089 0.9953 1.0075 0.9963 0.9952 1.0091 1.0150 1.0030 0.9997 1.0097 1.0146 1.0066 1.0016
dispcorr: -0.029067998 hartree
energy: -912.343258709127
dipole: 2.46145 -2.88229 -0.42084 -7.52876 7.20123 -0.32752 0.70451 -0.76567 -0.06116
magnitude: 0.53677 au
magnitude: 1.36435 debye
