program: Orca
programVersion: 5.0.2
elementType: O O N C C C C C C C C C C C C C C C C C C H H H H H H H H H H H H H H H H H H H H H H H H H H H H H H H H H H H
charge: 0
multiplicity: 1
keywords: wb97x-d3
keywords: def2-TZVPP
keywords: def2/J RIJCOSX
keywords: DEFGRID2
keywords: scfconv7
keywords: smallprint printgap noloewdin
keywords: NOSOSCF
formula: C18H35NO2
InChI: InChI=1/C18H35NO2/c1-6-12-19(7-2)13-16-14-20-18(21-16)10-8-15(9-11-18)17(3,4)5/h15-16H,6-14H2,1-5H3
56 atoms
O  -0.442765 0.877705 -0.302589
O  -0.136847 2.942819 0.511111
N  -2.831468 -0.973215 0.483206
C  3.102319 0.290203 -0.29759
C  0.553464 1.782998 0.129543
C  2.28495 0.872328 -1.455494
C  2.156925 -0.032592 0.86421
C  4.024501 -0.88772 -0.708688
C  1.479629 2.096917 -1.030067
C  1.349696 1.189067 1.292348
C  -1.686627 1.231902 0.267638
C  -1.370529 2.52798 1.030146
C  5.019538 -0.417392 -1.775522
C  4.839361 -1.356284 0.502135
C  3.234565 -2.07705 -1.25987
C  -2.27854 0.166145 1.179808
C  -3.942811 -1.577022 1.197035
C  -1.831073 -1.950614 0.07944
C  -5.243227 -0.789155 1.082093
C  -2.242699 -2.730593 -1.158084
C  -5.709375 -0.61545 -0.35515
H  3.774919 1.088458 0.052589
H  2.937337 1.162195 -2.280708
H  1.602954 0.115379 -1.852406
H  1.471293 -0.835812 0.578823
H  2.714915 -0.395562 1.728647
H  0.891668 2.482088 -1.865981
H  2.160561 2.8956 -0.720637
H  2.025161 1.961205 1.673668
H  0.683254 0.924308 2.118834
H  -2.399624 1.41033 -0.545143
H  -1.320455 2.349395 2.114392
H  -2.111211 3.310051 0.857449
H  5.575547 0.46126 -1.440307
H  5.747483 -1.201297 -1.993527
H  4.534544 -0.163834 -2.718312
H  5.585292 -2.093684 0.199144
H  4.219782 -1.826678 1.265958
H  5.371671 -0.524899 0.970247
H  2.521939 -2.469103 -0.532584
H  2.679728 -1.820659 -2.16334
H  3.910585 -2.894422 -1.519345
H  -3.089379 0.655568 1.728046
H  -1.533965 -0.121945 1.943108
H  -4.117837 -2.569928 0.776165
H  -3.701183 -1.742659 2.261093
H  -0.90434 -1.425706 -0.143681
H  -1.597228 -2.646828 0.902632
H  -5.143671 0.190803 1.558355
H  -6.005771 -1.31672 1.661751
H  -2.400673 -2.053817 -1.997012
H  -1.464627 -3.442669 -1.43516
H  -3.162482 -3.298417 -1.01103
H  -6.652861 -0.071335 -0.403395
H  -5.862148 -1.582209 -0.838542
H  -4.971527 -0.071965 -0.943288
totalener: -912.29547977 hartree
nucrepener: 1918.09516595 hartree
electener: -2830.39064572 hartree
oneelecener: -5049.14387928 hartree
twoeener: 2218.75323356 hartree
kineticenergy: 907.83319973 hartree
xcener: -92.073483063328 hartree
chargesum: -0.0000000
charge: -0.374305 -0.328035 -0.203719 0.086425 0.557293 -0.209223 -0.232665 0.229250 -0.258999 -0.284901 0.209296 -0.023393 -0.324387 -0.330425 -0.342324 -0.197330 -0.118800 -0.035359 -0.085955 -0.247816 -0.249304 0.048197 0.083482 0.083891 0.071977 0.084893 0.071687 0.080277 0.084396 0.071386 0.071076 0.059608 0.086512 0.092985 0.086220 0.087983 0.086338 0.088022 0.093495 0.088020 0.091393 0.090126 0.091709 0.083656 0.089359 0.080850 0.069892 0.064245 0.049363 0.066846 0.080937 0.082375 0.068314 0.086968 0.069424 0.078778
qa: -0.3743 -0.3280 -0.2037 0.0864 0.5573 -0.2092 -0.2327 0.2292 -0.2590 -0.2849 0.2093 -0.0234 -0.3244 -0.3304 -0.3423 -0.1973 -0.1188 -0.0354 -0.0860 -0.2478 -0.2493 0.0482 0.0835 0.0839 0.0720 0.0849 0.0717 0.0803 0.0844 0.0714 0.0711 0.0596 0.0865 0.0930 0.0862 0.0880 0.0863 0.0880 0.0935 0.0880 0.0914 0.0901 0.0917 0.0837 0.0894 0.0808 0.0699 0.0642 0.0494 0.0668 0.0809 0.0824 0.0683 0.0870 0.0694 0.0788
va: 2.0146 2.0742 2.8247 3.6917 3.8075 3.9100 3.9605 3.7401 4.0444 4.0112 3.8374 4.0121 3.9282 3.9312 3.9562 4.0061 3.9293 3.8991 3.8651 3.9311 3.9191 1.0185 1.0142 1.0186 1.0125 1.0165 1.0359 1.0179 1.0238 1.0231 1.0106 0.9950 0.9929 1.0049 1.0104 1.0041 1.0109 1.0015 1.0048 1.0037 1.0031 1.0080 0.9998 1.0128 0.9928 1.0118 1.0107 1.0058 1.0122 1.0139 1.0118 1.0122 1.0080 1.0065 1.0053 1.0228
dispcorr: -0.029771684 hartree
energy: -912.325251457211
dipole: 2.04761 -2.16157 -0.11396 -15.04340 14.81912 -0.22427 -2.22332 2.68452 0.46120
magnitude: 0.52535 au
magnitude: 1.33533 debye
