program: Orca
programVersion: 5.0.2
elementType: O O N C C C C C C C C C C C C C C C C C C H H H H H H H H H H H H H H H H H H H H H H H H H H H H H H H H H H H
charge: 0
multiplicity: 1
keywords: wb97x-d3
keywords: def2-TZVPP
keywords: def2/J RIJCOSX
keywords: DEFGRID2
keywords: scfconv7
keywords: smallprint printgap noloewdin
keywords: NOSOSCF
formula: C18H35NO2
InChI: InChI=1/C18H35NO2/c1-6-12-19(7-2)13-16-14-20-18(21-16)10-8-15(9-11-18)17(3,4)5/h15-16H,6-14H2,1-5H3
56 atoms
O  -0.386022 1.011802 -0.856032
O  -0.44707 2.504311 0.834774
N  -2.776159 -0.651233 -0.175323
C  2.962711 0.060743 0.113106
C  0.362421 1.52779 0.233814
C  2.597937 1.167867 -0.881041
C  1.674883 -0.608157 0.603275
C  4.026728 -0.937491 -0.416539
C  1.634617 2.183717 -0.275891
C  0.698004 0.398295 1.204465
C  -1.699708 1.52452 -0.819469
C  -1.782196 2.163981 0.561251
C  3.526318 -1.74169 -1.618769
C  5.292579 -0.177835 -0.828727
C  4.417884 -1.912293 0.698774
C  -2.75265 0.460458 -1.102847
C  -4.114009 -1.037956 0.239252
C  -1.944501 -1.775371 -0.572977
C  -4.671893 -0.146304 1.342395
C  -2.456348 -2.615778 -1.742129
C  -3.94224 -0.327833 2.664564
H  3.422041 0.552376 0.984571
H  3.491399 1.699286 -1.212681
H  2.144408 0.734677 -1.77721
H  1.191113 -1.130274 -0.226724
H  1.894868 -1.36651 1.356454
H  1.375059 2.950977 -1.009206
H  2.1176 2.69518 0.56245
H  1.138634 0.842551 2.102439
H  -0.221399 -0.10703 1.514911
H  -1.81044 2.297557 -1.594989
H  -2.186008 1.460477 1.297205
H  -2.38959 3.070511 0.575611
H  2.660538 -2.357322 -1.371117
H  3.248537 -1.099029 -2.455412
H  4.307789 -2.41546 -1.976233
H  5.136899 0.442561 -1.71157
H  6.096936 -0.876154 -1.068408
H  5.649456 0.469585 -0.024391
H  3.596995 -2.569886 0.985218
H  5.242048 -2.552888 0.378499
H  4.746021 -1.379786 1.594527
H  -2.641188 0.129148 -2.144946
H  -3.717942 0.976033 -1.071772
H  -4.818382 -1.065156 -0.60657
H  -4.069418 -2.062167 0.621866
H  -0.953246 -1.393951 -0.81201
H  -1.816943 -2.421125 0.300876
H  -5.73337 -0.374299 1.471232
H  -4.632064 0.902223 1.030428
H  -2.57168 -2.026613 -2.652891
H  -1.750017 -3.416337 -1.964818
H  -3.418566 -3.081419 -1.525115
H  -2.867655 -0.190152 2.543623
H  -4.09892 -1.332803 3.060961
H  -4.288836 0.380042 3.417514
totalener: -912.29456197 hartree
nucrepener: 1948.45117672 hartree
electener: -2860.74573869 hartree
oneelecener: -5110.09668659 hartree
twoeener: 2249.35094789 hartree
kineticenergy: 907.83631443 hartree
xcener: -92.079684857475 hartree
chargesum: 0.0000000
charge: -0.390373 -0.338043 -0.196450 0.092266 0.578073 -0.207070 -0.257177 0.239510 -0.269028 -0.283756 0.207826 -0.003912 -0.347560 -0.325823 -0.328661 -0.158324 -0.099060 -0.072836 -0.112198 -0.258295 -0.256986 0.048836 0.081655 0.081389 0.084596 0.084435 0.068331 0.079254 0.087350 0.070014 0.054895 0.050448 0.087037 0.085951 0.093333 0.089505 0.087679 0.085684 0.093643 0.087505 0.085879 0.092369 0.090647 0.080566 0.086773 0.073300 0.085462 0.074912 0.070921 0.056090 0.074437 0.087421 0.078366 0.081648 0.077839 0.089705
qa: -0.3904 -0.3380 -0.1964 0.0923 0.5781 -0.2071 -0.2572 0.2395 -0.2690 -0.2838 0.2078 -0.0039 -0.3476 -0.3258 -0.3287 -0.1583 -0.0991 -0.0728 -0.1122 -0.2583 -0.2570 0.0488 0.0817 0.0814 0.0846 0.0844 0.0683 0.0793 0.0874 0.0700 0.0549 0.0504 0.0870 0.0860 0.0933 0.0895 0.0877 0.0857 0.0936 0.0875 0.0859 0.0924 0.0906 0.0806 0.0868 0.0733 0.0855 0.0749 0.0709 0.0561 0.0744 0.0874 0.0784 0.0816 0.0778 0.0897
va: 2.0204 2.0712 2.7995 3.6911 3.8086 3.9026 3.9829 3.7239 4.0688 4.0268 3.8923 4.0091 3.9563 3.9279 3.9302 3.9640 3.9064 3.9594 3.8853 3.9320 3.9178 1.0188 1.0139 1.0220 0.9934 1.0153 1.0306 1.0183 1.0253 1.0240 1.0016 1.0082 0.9941 1.0046 1.0040 1.0081 1.0023 1.0110 1.0047 1.0030 1.0101 1.0053 1.0088 1.0064 0.9974 0.9966 1.0081 0.9945 1.0171 1.0080 1.0062 1.0126 1.0018 1.0051 1.0046 1.0078
dispcorr: -0.031324772 hartree
energy: -912.325886744910
dipole: 3.53095 -4.04069 -0.50974 -14.03648 13.71991 -0.31657 -0.06321 -0.10057 -0.16378
magnitude: 0.62199 au
magnitude: 1.58098 debye
