program: Orca
programVersion: 5.0.2
elementType: O O N C C C C C C C C C C C C C C C C C C H H H H H H H H H H H H H H H H H H H H H H H H H H H H H H H H H H H
charge: 0
multiplicity: 1
keywords: wb97x-d3
keywords: def2-TZVPP
keywords: def2/J RIJCOSX
keywords: DEFGRID2
keywords: scfconv7
keywords: smallprint printgap noloewdin
keywords: NOSOSCF
formula: C18H35NO2
InChI: InChI=1/C18H35NO2/c1-6-12-19(7-2)13-16-14-20-18(21-16)10-8-15(9-11-18)17(3,4)5/h15-16H,6-14H2,1-5H3
56 atoms
O  -0.5521 0.682688 0.013901
O  -0.257033 2.788069 0.785678
N  -3.332474 -0.719912 -0.377031
C  2.987102 0.100155 0.147288
C  0.430536 1.607142 0.444997
C  2.224637 0.668244 -1.054186
C  1.988868 -0.205688 1.269196
C  3.921692 -1.087074 -0.205933
C  1.406524 1.901301 -0.682454
C  1.166677 1.023455 1.645304
C  -1.826323 1.291392 0.036822
C  -1.605918 2.462145 0.985438
C  4.709417 -1.515991 1.037296
C  3.148348 -2.295291 -0.73929
C  4.941595 -0.647087 -1.262184
C  -2.899687 0.322686 0.522678
C  -2.345496 -1.740396 -0.68608
C  -4.0167 -0.257234 -1.567662
C  -1.810536 -2.480139 0.532836
C  -5.216611 0.633478 -1.286677
C  -2.901689 -3.116273 1.381757
H  3.646749 0.901241 0.515358
H  2.91404 0.942994 -1.853982
H  1.557102 -0.0926 -1.468685
H  1.313606 -1.009901 0.962948
H  2.506072 -0.559804 2.162386
H  0.855959 2.272302 -1.550765
H  2.075793 2.706477 -0.363633
H  1.825691 1.796809 2.051558
H  0.449139 0.773802 2.43245
H  -2.08138 1.668438 -0.964912
H  -1.810677 2.17151 2.027171
H  -2.224442 3.329568 0.74952
H  5.455405 -2.269299 0.776545
H  5.239294 -0.67142 1.484033
H  4.072395 -1.953293 1.806313
H  3.83443 -3.11242 -0.971917
H  2.602588 -2.063606 -1.65499
H  2.4299 -2.677118 -0.012462
H  5.482803 0.247461 -0.944791
H  5.6806 -1.432639 -1.432492
H  4.479994 -0.431672 -2.225995
H  -3.776434 0.915762 0.800723
H  -2.552814 -0.128532 1.456692
H  -2.845491 -2.473661 -1.327887
H  -1.499325 -1.350426 -1.271158
H  -3.343721 0.25491 -2.276657
H  -4.371583 -1.147097 -2.094221
H  -1.188827 -1.816931 1.138658
H  -1.132371 -3.255308 0.165753
H  -5.869873 0.177896 -0.541971
H  -4.938528 1.626922 -0.932984
H  -5.793654 0.774238 -2.200512
H  -2.478052 -3.680698 2.213017
H  -3.507257 -3.805278 0.790226
H  -3.578932 -2.369244 1.794562
totalener: -912.29512614 hartree
nucrepener: 1938.37157420 hartree
electener: -2850.66670034 hartree
oneelecener: -5089.74898868 hartree
twoeener: 2239.08228833 hartree
kineticenergy: 907.82402004 hartree
xcener: -92.076360937510 hartree
chargesum: 0.0000000
charge: -0.341189 -0.332522 -0.155494 0.086111 0.533461 -0.211738 -0.221801 0.234099 -0.266291 -0.267338 0.138610 0.015273 -0.330031 -0.341869 -0.326324 -0.210523 -0.084821 -0.068042 -0.103665 -0.255523 -0.245855 0.049955 0.082235 0.080543 0.075664 0.082970 0.068103 0.080983 0.081516 0.069010 0.069342 0.056261 0.081528 0.086053 0.092876 0.088463 0.089651 0.090259 0.087899 0.093477 0.086164 0.087507 0.100510 0.087447 0.080082 0.084597 0.060003 0.073085 0.044087 0.068780 0.089917 0.068921 0.087563 0.084021 0.070375 0.075627
qa: -0.3412 -0.3325 -0.1555 0.0861 0.5335 -0.2117 -0.2218 0.2341 -0.2663 -0.2673 0.1386 0.0153 -0.3300 -0.3419 -0.3263 -0.2105 -0.0848 -0.0680 -0.1037 -0.2555 -0.2459 0.0500 0.0822 0.0805 0.0757 0.0830 0.0681 0.0810 0.0815 0.0690 0.0693 0.0563 0.0815 0.0861 0.0929 0.0885 0.0897 0.0903 0.0879 0.0935 0.0862 0.0875 0.1005 0.0874 0.0801 0.0846 0.0600 0.0731 0.0441 0.0688 0.0899 0.0689 0.0876 0.0840 0.0704 0.0756
va: 2.0194 2.0675 2.9011 3.6963 3.8389 3.9186 3.9604 3.7337 4.0533 4.0420 3.8476 4.0147 3.9308 3.9570 3.9276 4.0743 3.9177 3.9319 3.8750 3.9125 3.9568 1.0181 1.0152 1.0166 1.0052 1.0157 1.0273 1.0190 1.0235 1.0203 0.9975 0.9956 0.9949 1.0107 1.0048 1.0025 1.0083 1.0039 1.0040 1.0048 1.0107 1.0031 0.9957 1.0057 0.9963 1.0108 0.9919 0.9973 1.0173 1.0089 1.0111 1.0006 1.0092 1.0058 1.0060 1.0109
dispcorr: -0.030362641 hartree
energy: -912.325488783602
dipole: 3.68220 -3.83088 -0.14868 -13.56204 13.61234 0.05030 -2.13935 2.04075 -0.09860
magnitude: 0.18536 au
magnitude: 0.47114 debye
