program: Orca
programVersion: 5.0.2
elementType: O O N C C C C C C C C C C C C C C C C C C H H H H H H H H H H H H H H H H H H H H H H H H H H H H H H H H H H H
charge: 0
multiplicity: 1
keywords: wb97x-d3
keywords: def2-TZVPP
keywords: def2/J RIJCOSX
keywords: DEFGRID2
keywords: scfconv7
keywords: smallprint printgap noloewdin
keywords: NOSOSCF
formula: C18H35NO2
InChI: InChI=1/C18H35NO2/c1-6-12-19(7-2)13-16-14-20-18(21-16)10-8-15(9-11-18)17(3,4)5/h15-16H,6-14H2,1-5H3
56 atoms
O  -0.586241 0.880783 0.277129
O  -0.080515 3.05388 0.64726
N  -3.201307 -0.378446 -0.149341
C  2.876393 0.052799 -0.050054
C  0.488181 1.784085 0.387972
C  1.968701 0.504482 -1.198843
C  2.060359 0.005608 1.245794
C  3.657112 -1.254051 -0.351761
C  1.287006 1.837566 -0.908643
C  1.377848 1.339142 1.537454
C  -1.763568 1.608984 0.027211
C  -1.475079 2.922819 0.74104
C  2.7256 -2.429205 -0.657975
C  4.583534 -1.034552 -1.552914
C  4.53737 -1.626464 0.846155
C  -2.954174 0.848416 0.5747
C  -3.525111 -1.501237 0.707802
C  -4.083572 -0.198671 -1.283277
C  -2.295877 -2.085078 1.396754
C  -3.895151 -1.25285 -2.361589
C  -1.263528 -2.615359 0.414476
H  3.640328 0.8342 0.085024
H  2.538282 0.601656 -2.124758
H  1.201212 -0.25173 -1.385202
H  1.303999 -0.782515 1.187391
H  2.700467 -0.242118 2.094041
H  0.628481 2.114808 -1.736977
H  2.03518 2.631962 -0.826215
H  2.134047 2.111945 1.704505
H  0.783108 1.272938 2.452323
H  -1.894098 1.781984 -1.052537
H  -1.805984 2.8827 1.788971
H  -1.95832 3.780555 0.268196
H  3.3058 -3.337549 -0.833379
H  2.041193 -2.638651 0.165484
H  2.123007 -2.256613 -1.550443
H  5.24955 -0.183861 -1.391293
H  4.03407 -0.855582 -2.477282
H  5.20935 -1.913483 -1.719997
H  5.165913 -0.788499 1.157013
H  3.952904 -1.943288 1.710245
H  5.200402 -2.455038 0.589448
H  -3.83587 1.511156 0.578168
H  -2.746716 0.623782 1.623927
H  -4.286562 -1.236148 1.460557
H  -3.97509 -2.28671 0.096528
H  -5.144469 -0.153173 -0.981377
H  -3.860634 0.775416 -1.726381
H  -2.629167 -2.88488 2.064014
H  -1.83007 -1.332606 2.03908
H  -4.515385 -1.023651 -3.228581
H  -2.854012 -1.285399 -2.68122
H  -4.171492 -2.251933 -2.024012
H  -1.681638 -3.405358 -0.212919
H  -0.402903 -3.034692 0.937234
H  -0.908092 -1.819619 -0.237025
totalener: -912.29525261 hartree
nucrepener: 1953.25420937 hartree
electener: -2865.54946198 hartree
oneelecener: -5119.72275879 hartree
twoeener: 2254.17329680 hartree
kineticenergy: 907.84666167 hartree
xcener: -92.076089222054 hartree
chargesum: -0.0000000
charge: -0.337627 -0.341572 -0.191318 0.092866 0.538411 -0.221316 -0.217007 0.233077 -0.266128 -0.236942 0.126695 0.044375 -0.345954 -0.324411 -0.330100 -0.151005 -0.125400 -0.055742 -0.059435 -0.244222 -0.276976 0.050229 0.081917 0.081752 0.072236 0.080888 0.066746 0.081515 0.078428 0.066090 0.045179 0.050276 0.072363 0.091551 0.081572 0.091008 0.090986 0.086813 0.085783 0.093255 0.087571 0.086044 0.088219 0.080869 0.080221 0.085267 0.065832 0.065321 0.066505 0.052081 0.085436 0.081966 0.071363 0.079461 0.086287 0.078699
qa: -0.3376 -0.3416 -0.1913 0.0929 0.5384 -0.2213 -0.2170 0.2331 -0.2661 -0.2369 0.1267 0.0444 -0.3460 -0.3244 -0.3301 -0.1510 -0.1254 -0.0557 -0.0594 -0.2442 -0.2770 0.0502 0.0819 0.0818 0.0722 0.0809 0.0667 0.0815 0.0784 0.0661 0.0452 0.0503 0.0724 0.0916 0.0816 0.0910 0.0910 0.0868 0.0858 0.0933 0.0876 0.0860 0.0882 0.0809 0.0802 0.0853 0.0658 0.0653 0.0665 0.0521 0.0854 0.0820 0.0714 0.0795 0.0863 0.0787
va: 2.0372 2.0628 2.8015 3.6863 3.8457 3.9321 3.9581 3.7288 4.0506 4.0354 3.9693 3.9979 3.9671 3.9299 3.9320 3.9684 3.9418 3.9148 3.8280 3.9235 3.9155 1.0170 1.0165 1.0125 1.0094 1.0153 1.0209 1.0216 1.0217 1.0277 1.0053 0.9911 0.9938 1.0101 1.0056 1.0012 1.0056 1.0048 1.0102 1.0043 1.0005 1.0114 1.0082 1.0170 1.0096 0.9971 1.0059 0.9962 1.0153 1.0196 1.0110 1.0113 1.0071 1.0094 1.0045 1.0237
dispcorr: -0.031190086 hartree
energy: -912.326442701124
dipole: 4.31573 -4.85855 -0.54282 -16.62761 16.62543 -0.00219 -4.20774 4.14087 -0.06687
magnitude: 0.54693 au
magnitude: 1.39019 debye
