program: Orca
programVersion: 5.0.2
elementType: O O N C C C C C C C C C C C C C C C C C C H H H H H H H H H H H H H H H H H H H H H H H H H H H H H H H H H H H
charge: 0
multiplicity: 1
keywords: wb97x-d3
keywords: def2-TZVPP
keywords: def2/J RIJCOSX
keywords: DEFGRID2
keywords: scfconv7
keywords: smallprint printgap noloewdin
keywords: NOSOSCF
formula: C18H35NO2
InChI: InChI=1/C18H35NO2/c1-6-12-19(7-2)13-16-14-20-18(21-16)10-8-15(9-11-18)17(3,4)5/h15-16H,6-14H2,1-5H3
56 atoms
O  0.069419 -0.273383 -0.388656
O  -0.48896 1.829117 0.217051
N  -3.520868 -0.690642 0.4186
C  3.533425 0.413176 0.245346
C  0.604844 0.964394 0.05583
C  2.819109 0.582071 -1.099708
C  2.532135 -0.113583 1.278323
C  4.845676 -0.411691 0.160931
C  1.594555 1.48518 -0.982657
C  1.302664 0.782055 1.394029
C  -1.319307 -0.138727 -0.603273
C  -1.520313 1.371635 -0.622233
C  4.603842 -1.832151 -0.355066
C  5.836893 0.290035 -0.773744
C  5.499143 -0.495198 1.544888
C  -2.082693 -0.826406 0.526466
C  -4.082637 -1.383086 -0.734745
C  -4.184071 -1.017253 1.67118
C  -4.40004 -0.474712 -1.922179
C  -5.58976 -0.452538 1.779371
C  -5.408358 0.616588 -1.602792
H  3.833761 1.418862 0.577804
H  3.492875 1.008439 -1.844946
H  2.5072 -0.392472 -1.485041
H  2.213328 -1.12519 1.011693
H  2.996505 -0.183923 2.263097
H  1.102381 1.582272 -1.954584
H  1.905659 2.491126 -0.684311
H  1.597741 1.767799 1.766567
H  0.595834 0.368873 2.118096
H  -1.561714 -0.596003 -1.567133
H  -2.482935 1.673755 -0.208845
H  -1.435578 1.777638 -1.639233
H  5.540315 -2.393542 -0.374288
H  3.908978 -2.386579 0.277331
H  4.205568 -1.837949 -1.370417
H  6.013854 1.322402 -0.462839
H  5.494417 0.308339 -1.808653
H  6.800365 -0.223567 -0.766689
H  6.493377 -0.940317 1.471922
H  5.616065 0.494862 1.991935
H  4.926456 -1.109256 2.240253
H  -1.767886 -0.361669 1.464992
H  -1.760889 -1.88103 0.572464
H  -3.413935 -2.192295 -1.063254
H  -5.010127 -1.882523 -0.439799
H  -4.207706 -2.104752 1.852891
H  -3.587708 -0.591773 2.481034
H  -4.779795 -1.103335 -2.733019
H  -3.484967 -0.018316 -2.307073
H  -6.010112 -0.683893 2.758537
H  -5.580496 0.630271 1.659569
H  -6.267507 -0.865579 1.031791
H  -5.051359 1.25276 -0.793529
H  -6.366735 0.196203 -1.292933
H  -5.593351 1.248722 -2.471349
totalener: -912.29438609 hartree
nucrepener: 1886.18213033 hartree
electener: -2798.47651642 hartree
oneelecener: -4985.38125407 hartree
twoeener: 2186.90473765 hartree
kineticenergy: 907.83236087 hartree
xcener: -92.073799401097 hartree
chargesum: -0.0000000
charge: -0.382349 -0.344529 -0.200186 0.084123 0.533408 -0.218184 -0.213059 0.225076 -0.270579 -0.263772 0.208751 0.006299 -0.339170 -0.323907 -0.327537 -0.194266 -0.111905 -0.057328 -0.100890 -0.248990 -0.244508 0.048281 0.081780 0.084168 0.083876 0.080237 0.065083 0.077585 0.083223 0.071392 0.082607 0.084982 0.068573 0.088788 0.090793 0.088519 0.091813 0.086961 0.085716 0.085715 0.093675 0.086857 0.082536 0.082720 0.083778 0.089186 0.066556 0.067361 0.070760 0.052799 0.090670 0.080473 0.069480 0.070279 0.073287 0.092993
qa: -0.3823 -0.3445 -0.2002 0.0841 0.5334 -0.2182 -0.2131 0.2251 -0.2706 -0.2638 0.2088 0.0063 -0.3392 -0.3239 -0.3275 -0.1943 -0.1119 -0.0573 -0.1009 -0.2490 -0.2445 0.0483 0.0818 0.0842 0.0839 0.0802 0.0651 0.0776 0.0832 0.0714 0.0826 0.0850 0.0686 0.0888 0.0908 0.0885 0.0918 0.0870 0.0857 0.0857 0.0937 0.0869 0.0825 0.0827 0.0838 0.0892 0.0666 0.0674 0.0708 0.0528 0.0907 0.0805 0.0695 0.0703 0.0733 0.0930
va: 2.0340 2.0603 2.8168 3.7017 3.8634 3.9258 3.9171 3.7379 4.0881 4.0374 3.8701 3.9599 3.9534 3.9304 3.9310 4.0120 3.8767 3.9133 3.8580 3.9178 3.9192 1.0178 1.0133 1.0210 1.0204 1.0138 1.0185 1.0220 1.0195 1.0229 0.9956 1.0204 0.9936 1.0070 1.0050 1.0040 1.0052 1.0043 1.0104 1.0112 1.0044 1.0015 1.0103 1.0185 1.0123 0.9990 1.0014 0.9990 1.0157 1.0140 1.0132 1.0078 1.0060 1.0175 1.0035 1.0092
dispcorr: -0.029473001 hartree
energy: -912.323859093245
dipole: 0.80932 -1.13837 -0.32905 -5.22066 4.92851 -0.29215 -0.06669 -0.05211 -0.11880
magnitude: 0.45578 au
magnitude: 1.15851 debye
