program: Orca
programVersion: 5.0.2
elementType: O O N C C C C C C C C C C C C C C C C C C H H H H H H H H H H H H H H H H H H H H H H H H H H H H H H H H H H H
charge: 0
multiplicity: 1
keywords: wb97x-d3
keywords: def2-TZVPP
keywords: def2/J RIJCOSX
keywords: DEFGRID2
keywords: scfconv7
keywords: smallprint printgap noloewdin
keywords: NOSOSCF
formula: C18H35NO2
InChI: InChI=1/C18H35NO2/c1-6-12-19(7-2)13-16-14-20-18(21-16)10-8-15(9-11-18)17(3,4)5/h15-16H,6-14H2,1-5H3
56 atoms
O  0.058572 0.123983 -0.656425
O  -0.310302 2.25414 -0.050594
N  -3.313592 -0.800224 0.50202
C  3.517392 0.38433 0.216994
C  0.688767 1.274134 -0.122617
C  2.912874 0.695686 -1.156585
C  2.39976 -0.07014 1.162354
C  4.731748 -0.581394 0.171622
C  1.787757 1.724269 -1.068357
C  1.280311 0.96251 1.252217
C  -1.337913 0.233454 -0.492643
C  -1.523827 1.589096 0.197516
C  4.345488 -1.97674 -0.323462
C  5.813902 -0.015446 -0.754564
C  5.344868 -0.706201 1.571211
C  -1.883297 -0.930833 0.320191
C  -4.082262 -1.093731 -0.701485
C  -3.811075 -1.477517 1.683626
C  -4.93725 0.073884 -1.17911
C  -5.212014 -1.038625 2.073581
C  -5.753998 -0.280741 -2.412928
H  3.907454 1.333966 0.614802
H  3.676171 1.083211 -1.833085
H  2.527628 -0.218614 -1.616304
H  1.981098 -1.019762 0.818205
H  2.790132 -0.247215 2.165948
H  1.359117 1.910823 -2.055601
H  2.187052 2.676612 -0.706555
H  1.668225 1.893046 1.67815
H  0.499683 0.611147 1.933876
H  -1.802787 0.243579 -1.487283
H  -1.718956 1.466289 1.271297
H  -2.341567 2.176031 -0.220063
H  3.623698 -2.462006 0.33479
H  3.9155 -1.951334 -1.325714
H  5.225536 -2.621927 -0.366896
H  5.509892 -0.014968 -1.801558
H  6.724576 -0.614147 -0.688826
H  6.076338 1.009778 -0.48281
H  5.592175 0.273491 1.986666
H  4.680777 -1.207749 2.275337
H  6.267955 -1.288292 1.5360
H  -1.400697 -0.912029 1.301657
H  -1.593107 -1.884371 -0.150002
H  -3.406251 -1.388807 -1.512388
H  -4.724176 -1.971032 -0.540466
H  -3.793146 -2.575113 1.56949
H  -3.136389 -1.246204 2.511187
H  -4.287359 0.927056 -1.392342
H  -5.598379 0.395479 -0.371647
H  -5.956229 -1.306924 1.322828
H  -5.509747 -1.518491 3.006193
H  -5.251432 0.041163 2.216851
H  -6.435318 -1.110048 -2.213839
H  -5.113042 -0.578222 -3.244997
H  -6.355969 0.562719 -2.749973
totalener: -912.29509744 hartree
nucrepener: 1873.93414929 hartree
electener: -2786.22924673 hartree
oneelecener: -4960.80544705 hartree
twoeener: 2174.57620032 hartree
kineticenergy: 907.83039091 hartree
xcener: -92.071802305518 hartree
chargesum: -0.0000000
charge: -0.377299 -0.333402 -0.187898 0.080310 0.578504 -0.210160 -0.217229 0.226080 -0.259967 -0.312369 0.195038 0.016828 -0.340787 -0.325924 -0.326387 -0.173354 -0.122170 -0.051725 -0.063365 -0.253299 -0.256477 0.047121 0.081419 0.083542 0.083322 0.082039 0.069897 0.078965 0.082996 0.069976 0.062734 0.056758 0.075306 0.087515 0.092178 0.089158 0.087478 0.085730 0.092909 0.092588 0.086801 0.086173 0.071759 0.084870 0.083344 0.079312 0.060902 0.065271 0.052456 0.063127 0.072941 0.087421 0.083435 0.073560 0.074462 0.087584
qa: -0.3773 -0.3334 -0.1879 0.0803 0.5785 -0.2102 -0.2172 0.2261 -0.2600 -0.3124 0.1950 0.0168 -0.3408 -0.3259 -0.3264 -0.1734 -0.1222 -0.0517 -0.0634 -0.2533 -0.2565 0.0471 0.0814 0.0835 0.0833 0.0820 0.0699 0.0790 0.0830 0.0700 0.0627 0.0568 0.0753 0.0875 0.0922 0.0892 0.0875 0.0857 0.0929 0.0926 0.0868 0.0862 0.0718 0.0849 0.0833 0.0793 0.0609 0.0653 0.0525 0.0631 0.0729 0.0874 0.0834 0.0736 0.0745 0.0876
va: 2.0416 2.0722 2.8231 3.7069 3.7983 3.9080 3.9277 3.7386 4.0558 4.0476 3.8692 3.9948 3.9544 3.9303 3.9297 4.0104 3.8974 3.9252 3.8480 3.9157 3.9524 1.0188 1.0134 1.0222 1.0179 1.0140 1.0337 1.0181 1.0234 1.0164 0.9964 1.0071 1.0005 1.0041 1.0045 1.0071 1.0023 1.0111 1.0046 1.0052 1.0036 1.0104 1.0045 1.0166 1.0050 1.0036 1.0032 0.9981 1.0184 1.0131 0.9992 1.0127 1.0099 1.0038 1.0034 1.0059
dispcorr: -0.028561905 hartree
energy: -912.323659349553
dipole: -0.30527 -0.09674 -0.40200 -9.17884 8.75486 -0.42397 1.35861 -1.10928 0.24932
magnitude: 0.63524 au
magnitude: 1.61464 debye
