program: Orca
programVersion: 5.0.2
elementType: O O N C C C C C C C C C C C C C C C C C C H H H H H H H H H H H H H H H H H H H H H H H H H H H H H H H H H H H
charge: 0
multiplicity: 1
keywords: wb97x-d3
keywords: def2-TZVPP
keywords: def2/J RIJCOSX
keywords: DEFGRID2
keywords: scfconv7
keywords: smallprint printgap noloewdin
keywords: NOSOSCF
formula: C18H35NO2
InChI: InChI=1/C18H35NO2/c1-6-12-19(7-2)13-16-14-20-18(21-16)10-8-15(9-11-18)17(3,4)5/h15-16H,6-14H2,1-5H3
56 atoms
O  -0.001122 0.005366 0.434125
O  -0.199502 2.24661 0.559546
N  -3.518332 -0.745379 -0.257201
C  3.558366 0.264078 0.113047
C  0.740858 1.199858 0.420882
C  2.566828 0.278828 -1.05468
C  2.782666 0.110975 1.425611
C  4.709419 -0.761987 -0.061271
C  1.502591 1.358256 -0.891983
C  1.712106 1.186965 1.587963
C  -1.295124 0.298471 -0.045374
C  -1.498529 1.713406 0.492876
C  5.63984 -0.716622 1.155547
C  4.1890 -2.191864 -0.22755
C  5.544699 -0.394332 -1.292489
C  -2.254051 -0.777824 0.446121
C  -4.492188 0.181721 0.284658
C  -4.049351 -2.057042 -0.574379
C  -5.510296 0.658484 -0.746097
C  -4.470514 -2.921742 0.613235
C  -4.866077 1.318741 -1.954932
H  4.039334 1.253957 0.141422
H  3.085431 0.441081 -2.001151
H  2.073292 -0.693412 -1.13536
H  2.311674 -0.874989 1.472435
H  3.457879 0.171324 2.280521
H  0.806496 1.334816 -1.735665
H  1.967686 2.348687 -0.904188
H  2.184977 2.171522 1.649432
H  1.159179 1.041038 2.519176
H  -1.324538 0.296107 -1.144402
H  -1.959767 1.692046 1.490061
H  -2.123167 2.329475 -0.158477
H  5.971764 0.302552 1.367794
H  5.166381 -1.107116 2.056665
H  6.531653 -1.320514 0.976987
H  5.022698 -2.893632 -0.29774
H  3.593512 -2.309231 -1.13372
H  3.57351 -2.506256 0.616712
H  6.403906 -1.061298 -1.386803
H  4.978561 -0.472109 -2.220946
H  5.928305 0.626039 -1.221326
H  -2.360625 -0.708932 1.540057
H  -1.773384 -1.739236 0.24991
H  -5.021731 -0.226666 1.160564
H  -3.960731 1.060582 0.655171
H  -4.899528 -1.933531 -1.249184
H  -3.293957 -2.590836 -1.1571
H  -6.182791 1.362826 -0.249216
H  -6.145044 -0.170851 -1.069522
H  -3.637336 -3.109211 1.292329
H  -5.273161 -2.463414 1.191557
H  -4.833289 -3.890234 0.26735
H  -5.616228 1.656347 -2.670117
H  -4.193247 0.632896 -2.467357
H  -4.280526 2.191971 -1.659603
totalener: -912.29416016 hartree
nucrepener: 1874.20695177 hartree
electener: -2786.50111193 hartree
oneelecener: -4961.37859678 hartree
twoeener: 2174.87748485 hartree
kineticenergy: 907.83748749 hartree
xcener: -92.077572405313 hartree
chargesum: -0.0000000
charge: -0.363928 -0.351427 -0.184661 0.084692 0.566760 -0.221671 -0.219119 0.224195 -0.282597 -0.246333 0.162989 0.011728 -0.328584 -0.340370 -0.324231 -0.142711 -0.129147 -0.070496 -0.093885 -0.251378 -0.251183 0.048714 0.081108 0.084015 0.085131 0.079668 0.071638 0.082754 0.077422 0.068652 0.047505 0.058199 0.069666 0.093425 0.087728 0.085808 0.088904 0.087282 0.092324 0.086345 0.086850 0.091012 0.081240 0.083696 0.085369 0.087113 0.075667 0.073413 0.067796 0.059064 0.079373 0.077261 0.087610 0.090877 0.083423 0.065303
qa: -0.3639 -0.3514 -0.1847 0.0847 0.5668 -0.2217 -0.2191 0.2242 -0.2826 -0.2463 0.1630 0.0117 -0.3286 -0.3404 -0.3242 -0.1427 -0.1291 -0.0705 -0.0939 -0.2514 -0.2512 0.0487 0.0811 0.0840 0.0851 0.0797 0.0716 0.0828 0.0774 0.0687 0.0475 0.0582 0.0697 0.0934 0.0877 0.0858 0.0889 0.0873 0.0923 0.0863 0.0868 0.0910 0.0812 0.0837 0.0854 0.0871 0.0757 0.0734 0.0678 0.0591 0.0794 0.0773 0.0876 0.0909 0.0834 0.0653
va: 2.0407 2.0648 2.8304 3.7014 3.8169 3.9320 3.9204 3.7392 4.0602 4.0488 3.8834 4.0056 3.9322 3.9534 3.9296 3.9669 3.9519 3.9729 3.8569 3.9050 3.9261 1.0176 1.0153 1.0164 1.0177 1.0135 1.0166 1.0231 1.0203 1.0311 1.0218 0.9911 0.9981 1.0044 1.0006 1.0113 1.0075 1.0032 1.0053 1.0096 1.0052 1.0058 1.0047 1.0082 1.0086 0.9945 0.9963 0.9988 1.0148 1.0062 1.0028 1.0035 1.0130 1.0083 1.0164 1.0072
dispcorr: -0.028692492 hartree
energy: -912.322852649881
dipole: 0.93051 -1.37505 -0.44454 -8.70911 8.34650 -0.36261 -3.36105 3.30640 -0.05465
magnitude: 0.57627 au
magnitude: 1.46476 debye
