program: Orca
programVersion: 5.0.2
elementType: O O N C C C C C C C C C C C C C C C C C C H H H H H H H H H H H H H H H H H H H H H H H H H H H H H H H H H H H
charge: 0
multiplicity: 1
keywords: wb97x-d3
keywords: def2-TZVPP
keywords: def2/J RIJCOSX
keywords: DEFGRID2
keywords: scfconv7
keywords: smallprint printgap noloewdin
keywords: NOSOSCF
formula: C18H35NO2
InChI: InChI=1/C18H35NO2/c1-6-12-19(7-2)13-16-14-20-18(21-16)10-8-15(9-11-18)17(3,4)5/h15-16H,6-14H2,1-5H3
56 atoms
O  0.021559 0.081199 -0.647934
O  -0.389304 1.496786 1.063191
N  -3.54529 -0.663301 -0.016257
C  3.549225 0.259715 -0.004937
C  0.646518 0.851889 0.366675
C  2.766654 1.152733 -0.972691
C  2.582282 -0.744477 0.631751
C  4.812499 -0.38912 -0.630571
C  1.600645 1.851532 -0.280713
C  1.408815 -0.054347 1.320278
C  -1.371555 0.313425 -0.627433
C  -1.481812 1.597317 0.18281
C  4.471938 -1.287265 -1.821824
C  5.778157 0.70564 -1.099031
C  5.545284 -1.226225 0.423561
C  -2.107196 -0.86402 0.011072
C  -4.185648 -0.641631 1.286336
C  -4.232395 -1.513673 -0.968405
C  -5.415574 0.256531 1.337002
C  -3.855058 -1.231487 -2.412873
C  -6.044687 0.27978 2.722462
H  3.915823 0.908268 0.805613
H  3.416102 1.912886 -1.410202
H  2.382008 0.556436 -1.804462
H  2.197443 -1.428862 -0.129695
H  3.096772 -1.360821 1.370682
H  1.058659 2.478254 -0.994631
H  1.980348 2.517581 0.500226
H  1.775795 0.550834 2.154859
H  0.724972 -0.795605 1.741938
H  -1.726175 0.454372 -1.652382
H  -2.40619 1.672361 0.756584
H  -1.410738 2.48445 -0.460188
H  5.377808 -1.747493 -2.222028
H  3.794615 -2.096792 -1.545911
H  4.008359 -0.729912 -2.636723
H  6.716303 0.267487 -1.445274
H  6.019318 1.397395 -0.288529
H  5.376223 1.290334 -1.926653
H  4.980074 -2.109193 0.722723
H  6.50284 -1.578376 0.034956
H  5.752184 -0.64227 1.323578
H  -1.75621 -0.981089 1.041436
H  -1.816879 -1.788264 -0.503913
H  -4.45545 -1.655042 1.631586
H  -3.465984 -0.261994 2.015945
H  -4.062645 -2.582037 -0.748886
H  -5.306456 -1.351307 -0.860342
H  -6.160696 -0.071329 0.607696
H  -5.121746 1.265449 1.03681
H  -4.448403 -1.852021 -3.084836
H  -4.039961 -0.186928 -2.663852
H  -2.806388 -1.449305 -2.618567
H  -6.9150 0.934763 2.75374
H  -5.338779 0.637279 3.474153
H  -6.372421 -0.714883 3.029117
totalener: -912.29589528 hartree
nucrepener: 1871.62768998 hartree
electener: -2783.92358526 hartree
oneelecener: -4956.32401835 hartree
twoeener: 2172.40043308 hartree
kineticenergy: 907.83436605 hartree
xcener: -92.072671854609 hartree
chargesum: -0.0000000
charge: -0.381422 -0.341052 -0.200525 0.080845 0.529002 -0.216363 -0.214132 0.226765 -0.266434 -0.261216 0.255707 -0.006089 -0.340634 -0.325172 -0.327107 -0.226027 -0.117442 -0.061261 -0.047903 -0.260851 -0.257505 0.048043 0.082267 0.084488 0.083683 0.080425 0.065028 0.077314 0.083662 0.068584 0.081563 0.079461 0.067036 0.088116 0.091161 0.089332 0.086167 0.091627 0.087423 0.087237 0.085849 0.093066 0.098042 0.085752 0.073609 0.080203 0.063401 0.076138 0.051856 0.048028 0.087290 0.080945 0.077762 0.086267 0.074919 0.073072
qa: -0.3814 -0.3411 -0.2005 0.0808 0.5290 -0.2164 -0.2141 0.2268 -0.2664 -0.2612 0.2557 -0.0061 -0.3406 -0.3252 -0.3271 -0.2260 -0.1174 -0.0613 -0.0479 -0.2609 -0.2575 0.0480 0.0823 0.0845 0.0837 0.0804 0.0650 0.0773 0.0837 0.0686 0.0816 0.0795 0.0670 0.0881 0.0912 0.0893 0.0862 0.0916 0.0874 0.0872 0.0858 0.0931 0.0980 0.0858 0.0736 0.0802 0.0634 0.0761 0.0519 0.0480 0.0873 0.0809 0.0778 0.0863 0.0749 0.0731
va: 2.0353 2.0552 2.8212 3.7056 3.8797 3.9236 3.9229 3.7372 4.0860 4.0345 3.8096 4.0157 3.9533 3.9303 3.9305 3.9400 3.9411 3.9187 3.8465 3.9144 3.9521 1.0177 1.0129 1.0216 1.0200 1.0143 1.0192 1.0223 1.0192 1.0261 1.0008 1.0070 0.9946 1.0073 1.0047 1.0035 1.0101 1.0055 1.0040 1.0021 1.0110 1.0047 1.0022 1.0160 1.0065 0.9945 1.0081 0.9959 1.0151 1.0208 1.0128 1.0109 1.0009 1.0059 1.0033 1.0038
dispcorr: -0.028263119 hartree
energy: -912.324158402937
dipole: 1.39404 -1.78966 -0.39563 -5.84252 5.69845 -0.14407 -1.64063 1.53280 -0.10784
magnitude: 0.43463 au
magnitude: 1.10474 debye
