program: Orca
programVersion: 5.0.2
elementType: O O N C C C C C C C C C C C C C C C C C C H H H H H H H H H H H H H H H H H H H H H H H H H H H H H H H H H H H
charge: 0
multiplicity: 1
keywords: wb97x-d3
keywords: def2-TZVPP
keywords: def2/J RIJCOSX
keywords: DEFGRID2
keywords: scfconv7
keywords: smallprint printgap noloewdin
keywords: NOSOSCF
formula: C18H35NO2
InChI: InChI=1/C18H35NO2/c1-6-12-19(7-2)13-16-14-20-18(21-16)10-8-15(9-11-18)17(3,4)5/h15-16H,6-14H2,1-5H3
56 atoms
O  0.005777 0.010014 0.401264
O  -0.1879 2.256495 0.366327
N  -3.540217 -0.731697 -0.152104
C  3.569117 0.252675 0.033879
C  0.749858 1.199246 0.297481
C  2.569713 0.180282 -1.124921
C  2.803201 0.187091 1.359519
C  4.728133 -0.774613 -0.075446
C  1.499406 1.262899 -1.030292
C  1.730335 1.268847 1.455294
C  -1.300158 0.279201 -0.059927
C  -1.486007 1.719534 0.406386
C  4.222614 -2.218623 -0.110779
C  5.537832 -0.505301 -1.348496
C  5.678025 -0.61728 1.116973
C  -2.252391 -0.763098 0.508633
C  -4.498539 0.188295 0.427464
C  -4.07465 -2.040901 -0.471479
C  -5.556093 0.66522 -0.56288
C  -4.448464 -2.925604 0.717446
C  -4.9642 1.324964 -1.798479
H  4.043256 1.245174 -0.011621
H  3.081421 0.283299 -2.083417
H  2.083401 -0.798902 -1.137228
H  2.335302 -0.794749 1.475214
H  3.484182 0.306249 2.203783
H  0.794938 1.174644 -1.862722
H  1.959372 2.25179 -1.119542
H  2.200402 2.256608 1.44535
H  1.185241 1.185836 2.398826
H  -1.356717 0.221348 -1.15667
H  -1.891553 1.751877 1.427517
H  -2.147805 2.29694 -0.243068
H  5.063488 -2.913479 -0.162713
H  3.648008 -2.474851 0.780575
H  3.591773 -2.412822 -0.979133
H  5.895801 0.526452 -1.380741
H  4.961983 -0.685355 -2.256651
H  6.413314 -1.15632 -1.39235
H  6.572138 -1.227713 0.976202
H  6.004004 0.418912 1.234327
H  5.22261 -0.931785 2.056196
H  -2.321879 -0.648896 1.601289
H  -1.792755 -1.739526 0.337166
H  -4.996091 -0.225909 1.319514
H  -3.956535 1.067264 0.783099
H  -4.948866 -1.911621 -1.113999
H  -3.337602 -2.561213 -1.089005
H  -6.207886 1.369745 -0.039238
H  -6.204109 -0.16404 -0.859368
H  -5.233042 -2.480471 1.330227
H  -4.817083 -3.891498 0.370313
H  -3.590545 -3.117045 1.364115
H  -5.744688 1.659481 -2.482061
H  -4.311867 0.639944 -2.338108
H  -4.368698 2.20022 -1.53022
totalener: -912.29418376 hartree
nucrepener: 1873.09869548 hartree
electener: -2785.39287923 hartree
oneelecener: -4959.17623094 hartree
twoeener: 2173.78335171 hartree
kineticenergy: 907.83087151 hartree
xcener: -92.076009023882 hartree
chargesum: -0.0000000
charge: -0.364174 -0.351823 -0.186557 0.084199 0.564309 -0.219390 -0.220850 0.225706 -0.279649 -0.247085 0.164801 0.010327 -0.340801 -0.324587 -0.328581 -0.141961 -0.129022 -0.071630 -0.092846 -0.250298 -0.253265 0.048807 0.080330 0.082979 0.085754 0.080307 0.070990 0.082947 0.077091 0.068470 0.045970 0.058702 0.072558 0.088928 0.091033 0.088198 0.091607 0.086852 0.085933 0.085827 0.093640 0.087585 0.082855 0.082971 0.084713 0.087749 0.075660 0.074437 0.067627 0.058901 0.077256 0.087433 0.078315 0.091411 0.083470 0.065873
qa: -0.3642 -0.3518 -0.1866 0.0842 0.5643 -0.2194 -0.2208 0.2257 -0.2796 -0.2471 0.1648 0.0103 -0.3408 -0.3246 -0.3286 -0.1420 -0.1290 -0.0716 -0.0928 -0.2503 -0.2533 0.0488 0.0803 0.0830 0.0858 0.0803 0.0710 0.0829 0.0771 0.0685 0.0460 0.0587 0.0726 0.0889 0.0910 0.0882 0.0916 0.0869 0.0859 0.0858 0.0936 0.0876 0.0829 0.0830 0.0847 0.0877 0.0757 0.0744 0.0676 0.0589 0.0773 0.0874 0.0783 0.0914 0.0835 0.0659
va: 2.0409 2.0646 2.8269 3.7006 3.8212 3.9294 3.9208 3.7383 4.0565 4.0513 3.8965 4.0027 3.9536 3.9298 3.9325 3.9586 3.9501 3.9750 3.8555 3.9058 3.9279 1.0176 1.0153 1.0172 1.0173 1.0133 1.0177 1.0228 1.0206 1.0300 1.0223 0.9923 0.9997 1.0074 1.0051 1.0036 1.0055 1.0046 1.0101 1.0113 1.0044 1.0010 1.0052 1.0086 1.0083 0.9947 0.9963 0.9980 1.0148 1.0056 1.0036 1.0130 1.0032 1.0084 1.0157 1.0069
dispcorr: -0.028691642 hartree
energy: -912.322875397539
dipole: 0.88202 -1.33358 -0.45156 -8.76975 8.39637 -0.37338 -2.53099 2.51867 -0.01232
magnitude: 0.58607 au
magnitude: 1.48966 debye
