program: Orca
programVersion: 5.0.2
elementType: O O N C C C C C C C C C C C C C C C C C C H H H H H H H H H H H H H H H H H H H H H H H H H H H H H H H H H H H
charge: 0
multiplicity: 1
keywords: wb97x-d3
keywords: def2-TZVPP
keywords: def2/J RIJCOSX
keywords: DEFGRID2
keywords: scfconv7
keywords: smallprint printgap noloewdin
keywords: NOSOSCF
formula: C18H35NO2
InChI: InChI=1/C18H35NO2/c1-6-12-19(7-2)13-16-14-20-18(21-16)10-8-15(9-11-18)17(3,4)5/h15-16H,6-14H2,1-5H3
56 atoms
O  -0.507654 0.963509 -0.552435
O  -0.149645 2.966748 0.428806
N  -3.325474 -0.084091 0.118369
C  2.877175 -0.019013 0.205642
C  0.470895 1.746413 0.110803
C  2.398807 0.638401 -1.092817
C  1.667527 -0.233884 1.120625
C  3.740499 -1.289803 -0.008272
C  1.660378 1.946199 -0.822064
C  0.922933 1.068422 1.396162
C  -1.726481 1.673298 -0.630819
C  -1.26831 3.112553 -0.406892
C  2.958845 -2.415221 -0.688582
C  4.963114 -0.946186 -0.867162
C  4.257431 -1.797615 1.342157
C  -2.769949 1.221675 0.38821
C  -2.453006 -1.207752 0.438451
C  -4.678251 -0.251028 0.613486
C  -2.031693 -2.012402 -0.784218
C  -5.41081 -1.408054 -0.045529
C  -1.175092 -3.213762 -0.412783
H  3.534459 0.706898 0.708896
H  3.240761 0.849142 -1.753965
H  1.738196 -0.042209 -1.637022
H  0.978023 -0.950027 0.6637
H  1.97145 -0.664982 2.075912
H  1.325011 2.39576 -1.760908
H  2.343719 2.661463 -0.354075
H  1.576436 1.758851 1.938262
H  0.055769 0.88791 2.036927
H  -2.146207 1.526402 -1.630577
H  -2.007719 3.735954 0.099871
H  -1.011167 3.597547 -1.357765
H  2.109461 -2.745988 -0.089156
H  2.577227 -2.119693 -1.666813
H  3.600355 -3.285502 -0.841797
H  5.520839 -0.106172 -0.446672
H  4.695912 -0.68855 -1.892026
H  5.644204 -1.797662 -0.92011
H  4.955343 -2.624907 1.198842
H  4.787762 -1.012923 1.886649
H  3.457207 -2.165255 1.984686
H  -3.588374 1.944657 0.320289
H  -2.360376 1.321297 1.408574
H  -1.556743 -0.855895 0.958187
H  -2.953754 -1.876099 1.15161
H  -4.709148 -0.380613 1.709257
H  -5.232548 0.666431 0.401156
H  -1.482659 -1.360286 -1.465436
H  -2.922907 -2.34248 -1.323547
H  -5.42683 -1.285554 -1.12825
H  -4.950794 -2.371267 0.176982
H  -6.440702 -1.45349 0.309813
H  -1.708613 -3.899339 0.248212
H  -0.264036 -2.906528 0.104191
H  -0.87203 -3.77793 -1.29465
totalener: -912.29303002 hartree
nucrepener: 1948.76730424 hartree
electener: -2861.06033426 hartree
oneelecener: -5110.64201557 hartree
twoeener: 2249.58168131 hartree
kineticenergy: 907.83119627 hartree
xcener: -92.072898219705 hartree
chargesum: -0.0000000
charge: -0.371671 -0.337079 -0.177056 0.084707 0.541426 -0.216704 -0.167045 0.239942 -0.258243 -0.293703 0.217344 -0.007298 -0.351815 -0.326095 -0.331567 -0.208538 -0.088464 -0.058834 -0.063156 -0.245993 -0.276624 0.050250 0.081890 0.082936 0.024245 0.084712 0.064572 0.077342 0.089584 0.076056 0.075909 0.071075 0.070212 0.086914 0.093965 0.092152 0.093431 0.087658 0.086512 0.087297 0.092648 0.088176 0.062809 0.095865 0.077293 0.077655 0.058520 0.062558 0.065477 0.058781 0.080580 0.073759 0.084307 0.080158 0.071611 0.089557
qa: -0.3717 -0.3371 -0.1771 0.0847 0.5414 -0.2167 -0.1670 0.2399 -0.2582 -0.2937 0.2173 -0.0073 -0.3518 -0.3261 -0.3316 -0.2085 -0.0885 -0.0588 -0.0632 -0.2460 -0.2766 0.0502 0.0819 0.0829 0.0242 0.0847 0.0646 0.0773 0.0896 0.0761 0.0759 0.0711 0.0702 0.0869 0.0940 0.0922 0.0934 0.0877 0.0865 0.0873 0.0926 0.0882 0.0628 0.0959 0.0773 0.0777 0.0585 0.0626 0.0655 0.0588 0.0806 0.0738 0.0843 0.0802 0.0716 0.0896
va: 2.0163 2.0563 2.8856 3.7103 3.8585 3.9276 3.9463 3.7306 4.0656 4.0197 3.7663 4.0485 3.9603 3.9307 3.9303 4.0020 3.8750 3.9384 3.8251 3.9011 3.9510 1.0180 1.0137 1.0175 1.0329 1.0167 1.0219 1.0219 1.0226 1.0230 1.0175 0.9958 0.9918 1.0003 1.0031 1.0098 1.0046 1.0027 1.0107 1.0104 1.0049 1.0027 1.0142 1.0039 1.0078 1.0021 1.0011 0.9991 1.0252 1.0174 1.0137 1.0012 1.0125 1.0059 0.9908 1.0053
dispcorr: -0.031395448 hartree
energy: -912.324425464679
dipole: 4.13799 -4.37643 -0.23844 -17.69296 17.83294 0.13998 0.07532 -0.08931 -0.01399
magnitude: 0.27685 au
magnitude: 0.70369 debye
