program: Orca
programVersion: 5.0.2
elementType: O O N C C C C C C C C C C C C C C C C C C H H H H H H H H H H H H H H H H H H H H H H H H H H H H H H H H H H H
charge: 0
multiplicity: 1
keywords: wb97x-d3
keywords: def2-TZVPP
keywords: def2/J RIJCOSX
keywords: DEFGRID2
keywords: scfconv7
keywords: smallprint printgap noloewdin
keywords: NOSOSCF
formula: C18H35NO2
InChI: InChI=1/C18H35NO2/c1-6-12-19(7-2)13-16-14-20-18(21-16)10-8-15(9-11-18)17(3,4)5/h15-16H,6-14H2,1-5H3
56 atoms
O  -0.083284 0.345101 -0.606609
O  -0.281975 2.439815 0.183005
N  -3.518215 -0.372858 0.555696
C  3.413613 0.314283 0.201853
C  0.640969 1.400686 0.000627
C  2.806426 0.772194 -1.128446
C  2.286164 -0.151221 1.129134
C  4.565157 -0.71535 0.050636
C  1.748172 1.85491 -0.933239
C  1.234553 0.934369 1.330484
C  -1.468453 0.564468 -0.430788
C  -1.529027 1.835516 0.418418
C  4.080939 -2.050322 -0.52018
C  5.652856 -0.153384 -0.871286
C  5.20929 -0.969053 1.418232
C  -2.126054 -0.637717 0.233705
C  -4.477252 -0.956827 -0.359553
C  -3.85529 -0.585984 1.950903
C  -4.441859 -0.361403 -1.760095
C  -3.842408 -2.034352 2.436029
C  -5.553273 -0.920783 -2.636929
H  3.866974 1.203186 0.667365
H  3.580158 1.168337 -1.787775
H  2.359499 -0.07772 -1.651686
H  1.803762 -1.040789 0.714877
H  2.681082 -0.437892 2.105316
H  1.313158 2.144204 -1.892587
H  2.212172 2.750563 -0.508942
H  1.684677 1.799368 1.827502
H  0.444444 0.570034 1.993989
H  -1.923688 0.74698 -1.410927
H  -1.677513 1.603037 1.482486
H  -2.321823 2.518274 0.11581
H  4.919433 -2.740033 -0.637214
H  3.354284 -2.537163 0.131366
H  3.62019 -1.933869 -1.502166
H  5.321203 -0.069709 -1.906448
H  6.529221 -0.804662 -0.869765
H  5.980655 0.83658 -0.545014
H  6.084718 -1.613463 1.316886
H  5.541159 -0.036363 1.880151
H  4.531553 -1.461928 2.11536
H  -1.565967 -0.857859 1.148818
H  -2.013695 -1.525767 -0.402435
H  -4.364153 -2.051607 -0.442814
H  -5.475411 -0.785641 0.056214
H  -3.16506 0.003807 2.559956
H  -4.845247 -0.156073 2.127966
H  -3.478302 -0.56564 -2.234356
H  -4.529439 0.725388 -1.685344
H  -4.579294 -2.645633 1.914225
H  -2.865476 -2.500174 2.294119
H  -4.074602 -2.082178 3.500694
H  -5.476278 -2.004921 -2.735004
H  -5.51811 -0.498578 -3.640752
H  -6.537656 -0.698265 -2.221574
totalener: -912.29473518 hartree
nucrepener: 1879.71457293 hartree
electener: -2792.00930811 hartree
oneelecener: -4972.44407112 hartree
twoeener: 2180.43476301 hartree
kineticenergy: 907.83138182 hartree
xcener: -92.074377890864 hartree
chargesum: 0.0000000
charge: -0.382134 -0.332471 -0.184361 0.080604 0.570560 -0.208813 -0.217569 0.225716 -0.262248 -0.307614 0.246142 -0.000644 -0.339210 -0.327528 -0.325210 -0.225954 -0.094512 -0.051570 -0.081645 -0.248332 -0.263682 0.047275 0.081148 0.083277 0.082619 0.082504 0.070109 0.079569 0.082760 0.066941 0.071316 0.054123 0.082568 0.089024 0.086890 0.091827 0.087609 0.085994 0.093281 0.086006 0.091776 0.086607 0.086662 0.092073 0.059821 0.069970 0.064910 0.071231 0.057791 0.064841 0.081405 0.075328 0.087999 0.073481 0.087390 0.074353
qa: -0.3821 -0.3325 -0.1844 0.0806 0.5706 -0.2088 -0.2176 0.2257 -0.2622 -0.3076 0.2461 -0.0006 -0.3392 -0.3275 -0.3252 -0.2260 -0.0945 -0.0516 -0.0816 -0.2483 -0.2637 0.0473 0.0811 0.0833 0.0826 0.0825 0.0701 0.0796 0.0828 0.0669 0.0713 0.0541 0.0826 0.0890 0.0869 0.0918 0.0876 0.0860 0.0933 0.0860 0.0918 0.0866 0.0867 0.0921 0.0598 0.0700 0.0649 0.0712 0.0578 0.0648 0.0814 0.0753 0.0880 0.0735 0.0874 0.0744
va: 2.0393 2.0747 2.8346 3.7087 3.8234 3.9046 3.9278 3.7375 4.0549 4.0489 3.8145 4.0119 3.9537 3.9312 3.9293 3.9814 3.9554 3.9610 3.8434 3.8993 3.9668 1.0185 1.0134 1.0217 1.0188 1.0140 1.0333 1.0178 1.0237 1.0149 1.0015 1.0040 1.0022 1.0072 1.0037 1.0048 1.0018 1.0111 1.0045 1.0102 1.0056 1.0045 0.9995 1.0101 0.9960 0.9969 0.9997 1.0006 1.0093 1.0163 1.0024 1.0050 1.0133 1.0042 1.0059 1.0033
dispcorr: -0.028506560 hartree
energy: -912.323241742101
dipole: 1.47150 -1.92305 -0.45155 -12.63334 12.19542 -0.43792 0.73580 -0.45918 0.27662
magnitude: 0.68716 au
magnitude: 1.74663 debye
