program: Orca
programVersion: 5.0.2
elementType: O O N C C C C C C C C C C C C C C C C C C H H H H H H H H H H H H H H H H H H H H H H H H H H H H H H H H H H H
charge: 0
multiplicity: 1
keywords: wb97x-d3
keywords: def2-TZVPP
keywords: def2/J RIJCOSX
keywords: DEFGRID2
keywords: scfconv7
keywords: smallprint printgap noloewdin
keywords: NOSOSCF
formula: C18H35NO2
InChI: InChI=1/C18H35NO2/c1-6-12-19(7-2)13-16-14-20-18(21-16)10-8-15(9-11-18)17(3,4)5/h15-16H,6-14H2,1-5H3
56 atoms
O  -0.031176 0.448802 -0.662859
O  -0.429432 1.362659 1.365348
N  -3.65155 -0.2008 -0.31969
C  3.453599 0.145655 0.068917
C  0.593106 0.856325 0.546015
C  2.782943 1.344426 -0.609857
C  2.388221 -0.906807 0.393801
C  4.672286 -0.415602 -0.712856
C  1.646708 1.914817 0.233037
C  1.244953 -0.335647 1.227375
C  -1.406912 0.764008 -0.608574
C  -1.472982 1.782449 0.518399
C  5.740226 0.673948 -0.858777
C  5.300681 -1.577335 0.064439
C  4.288594 -0.910788 -2.10929
C  -2.232683 -0.489569 -0.3237
C  -4.407386 -0.921948 0.686693
C  -4.261573 -0.210277 -1.635301
C  -4.222631 -0.355042 2.089052
C  -4.446312 -1.57883 -2.289442
C  -4.98903 -1.150542 3.135482
H  3.853805 0.503324 1.030336
H  3.507982 2.138369 -0.797274
H  2.385407 1.049967 -1.584813
H  1.979314 -1.322835 -0.531116
H  2.826277 -1.742534 0.942035
H  1.185953 2.763316 -0.280817
H  2.042456 2.295402 1.179816
H  1.621833 -0.013871 2.20313
H  0.491042 -1.104273 1.416513
H  -1.704734 1.201455 -1.56695
H  -2.4172 1.756148 1.061546
H  -1.316088 2.804416 0.148817
H  6.02549 1.085612 0.112105
H  6.642415 0.266503 -1.319348
H  5.408329 1.501086 -1.486519
H  4.659266 -2.458799 0.087811
H  5.517804 -1.295343 1.097621
H  6.242474 -1.88117 -0.396778
H  5.161341 -1.325305 -2.61791
H  3.532604 -1.69655 -2.07467
H  3.90228 -0.107507 -2.738032
H  -1.941534 -0.872492 0.657426
H  -1.953229 -1.272325 -1.043869
H  -5.468277 -0.848259 0.428032
H  -4.176116 -2.00005 0.69581
H  -5.234675 0.283878 -1.559731
H  -3.663723 0.42267 -2.296475
H  -4.553977 0.686342 2.089412
H  -3.1620 -0.336975 2.355805
H  -3.500509 -2.108078 -2.410788
H  -5.111964 -2.218826 -1.709041
H  -4.885066 -1.467618 -3.281676
H  -6.059563 -1.163587 2.923539
H  -4.857825 -0.726327 4.130553
H  -4.650347 -2.187225 3.17447
totalener: -912.29651915 hartree
nucrepener: 1881.49474277 hartree
electener: -2793.79126192 hartree
oneelecener: -4976.12338516 hartree
twoeener: 2182.33212325 hartree
kineticenergy: 907.82970999 hartree
xcener: -92.075086487929 hartree
chargesum: -0.0000000
charge: -0.383547 -0.344362 -0.196168 0.088008 0.531453 -0.219721 -0.214400 0.223495 -0.261655 -0.263398 0.271763 -0.016504 -0.325275 -0.327349 -0.340039 -0.240279 -0.086127 -0.056363 -0.084665 -0.250089 -0.261071 0.048107 0.081738 0.084538 0.083194 0.079325 0.064212 0.075961 0.083533 0.069002 0.070379 0.093336 0.068589 0.092016 0.085560 0.087329 0.087250 0.093200 0.085816 0.088591 0.090878 0.088942 0.092867 0.091654 0.071131 0.070864 0.070751 0.065122 0.057059 0.059614 0.076720 0.078108 0.086858 0.073178 0.087764 0.073110
qa: -0.3835 -0.3444 -0.1962 0.0880 0.5315 -0.2197 -0.2144 0.2235 -0.2617 -0.2634 0.2718 -0.0165 -0.3253 -0.3273 -0.3400 -0.2403 -0.0861 -0.0564 -0.0847 -0.2501 -0.2611 0.0481 0.0817 0.0845 0.0832 0.0793 0.0642 0.0760 0.0835 0.0690 0.0704 0.0933 0.0686 0.0920 0.0856 0.0873 0.0872 0.0932 0.0858 0.0886 0.0909 0.0889 0.0929 0.0917 0.0711 0.0709 0.0708 0.0651 0.0571 0.0596 0.0767 0.0781 0.0869 0.0732 0.0878 0.0731
va: 2.0402 2.0440 2.8397 3.7016 3.8707 3.9253 3.9266 3.7409 4.0897 4.0372 3.8539 3.9753 3.9301 3.9300 3.9534 3.9910 3.9228 3.9867 3.8569 3.8915 3.9682 1.0174 1.0129 1.0215 1.0204 1.0137 1.0196 1.0222 1.0192 1.0237 1.0039 1.0119 0.9958 1.0053 1.0104 1.0039 1.0014 1.0046 1.0111 1.0070 1.0052 1.0040 1.0033 1.0185 0.9971 0.9919 0.9985 0.9998 1.0163 1.0141 1.0069 1.0019 1.0132 1.0025 1.0060 1.0044
dispcorr: -0.028583297 hartree
energy: -912.325102442659
dipole: 2.16446 -2.55736 -0.39290 -8.81148 8.72004 -0.09144 -2.11486 1.89042 -0.22444
magnitude: 0.46164 au
magnitude: 1.17338 debye
