program: Orca
programVersion: 5.0.2
elementType: O O N C C C C C C C C C C C C C C C C C C H H H H H H H H H H H H H H H H H H H H H H H H H H H H H H H H H H H
charge: 0
multiplicity: 1
keywords: wb97x-d3
keywords: def2-TZVPP
keywords: def2/J RIJCOSX
keywords: DEFGRID2
keywords: scfconv7
keywords: smallprint printgap noloewdin
keywords: NOSOSCF
formula: C18H35NO2
InChI: InChI=1/C18H35NO2/c1-6-12-19(7-2)13-16-14-20-18(21-16)10-8-15(9-11-18)17(3,4)5/h15-16H,6-14H2,1-5H3
56 atoms
O  -0.496623 0.894107 -0.354284
O  -0.112889 3.097139 -0.098857
N  -3.209268 -0.501998 0.063892
C  2.94689 0.127059 0.124497
C  0.520369 1.844481 -0.09509
C  2.285829 0.447571 -1.220531
C  1.89481 0.199768 1.235746
C  3.762473 -1.193732 0.126821
C  1.55763 1.789071 -1.201786
C  1.173551 1.543399 1.251788
C  -1.768559 1.49719 -0.243619
C  -1.44045 2.887686 0.301475
C  2.869901 -2.426116 -0.041873
C  4.791123 -1.172987 -1.008697
C  4.534049 -1.319456 1.445155
C  -2.714429 0.716621 0.657582
C  -2.313121 -1.644288 0.117668
C  -4.585549 -0.812326 0.389178
C  -2.37582 -2.501023 -1.143735
C  -4.88476 -1.088626 1.862277
C  -2.007396 -1.729823 -2.401953
H  3.6749 0.92971 0.319498
H  3.031031 0.47704 -2.016637
H  1.576392 -0.340148 -1.489634
H  1.157167 -0.597524 1.109134
H  2.354801 0.041788 2.21265
H  1.069931 1.973124 -2.161961
H  2.277442 2.598698 -1.047359
H  1.885022 2.344168 1.475942
H  0.422942 1.555975 2.047943
H  -2.224766 1.562362 -1.239368
H  -1.551824 2.923947 1.395891
H  -2.070043 3.670523 -0.124053
H  2.172609 -2.545637 0.788396
H  2.28591 -2.387833 -0.962651
H  3.477431 -3.332446 -0.083018
H  4.325729 -1.228231 -1.993007
H  5.468163 -2.025775 -0.92868
H  5.401185 -0.266944 -0.978891
H  3.875106 -1.431992 2.306313
H  5.186813 -2.194319 1.427291
H  5.164294 -0.444469 1.620374
H  -3.573745 1.37094 0.842617
H  -2.2313 0.567629 1.637867
H  -1.292447 -1.28143 0.233563
H  -2.508066 -2.277709 0.996878
H  -5.215035 0.014107 0.044538
H  -4.889478 -1.67611 -0.207451
H  -3.372528 -2.938578 -1.256124
H  -1.696249 -3.347715 -1.009992
H  -4.661045 -0.224397 2.489617
H  -5.940349 -1.326466 1.999344
H  -4.309169 -1.932031 2.244938
H  -1.007403 -1.3004 -2.321383
H  -2.701632 -0.907757 -2.570377
H  -2.026386 -2.373301 -3.282283
totalener: -912.29429081 hartree
nucrepener: 1940.66165959 hartree
electener: -2852.95595040 hartree
oneelecener: -5094.45293364 hartree
twoeener: 2241.49698323 hartree
kineticenergy: 907.83162573 hartree
xcener: -92.076543399141 hartree
chargesum: 0.0000000
charge: -0.363206 -0.329140 -0.197075 0.085276 0.546350 -0.205546 -0.228907 0.230355 -0.258917 -0.271592 0.191217 -0.010971 -0.343285 -0.328174 -0.324598 -0.170749 -0.062069 -0.066516 -0.099365 -0.247327 -0.239789 0.049481 0.080128 0.077365 0.075582 0.086104 0.070371 0.080083 0.080870 0.067425 0.065516 0.057888 0.087829 0.087018 0.092087 0.090252 0.088847 0.085733 0.093129 0.086922 0.086314 0.091470 0.078585 0.073369 0.068329 0.075952 0.067561 0.072991 0.050112 0.060019 0.073602 0.086265 0.076709 0.068084 0.073851 0.088182
qa: -0.3632 -0.3291 -0.1971 0.0853 0.5464 -0.2055 -0.2289 0.2304 -0.2589 -0.2716 0.1912 -0.0110 -0.3433 -0.3282 -0.3246 -0.1707 -0.0621 -0.0665 -0.0994 -0.2473 -0.2398 0.0495 0.0801 0.0774 0.0756 0.0861 0.0704 0.0801 0.0809 0.0674 0.0655 0.0579 0.0878 0.0870 0.0921 0.0903 0.0888 0.0857 0.0931 0.0869 0.0863 0.0915 0.0786 0.0734 0.0683 0.0760 0.0676 0.0730 0.0501 0.0600 0.0736 0.0863 0.0767 0.0681 0.0739 0.0882
va: 2.0109 2.0721 2.8697 3.6993 3.8262 3.9383 3.9541 3.7393 4.0514 4.0346 3.8377 4.0263 3.9557 3.9300 3.9284 4.0043 3.9218 3.9806 3.8794 3.8984 3.9225 1.0182 1.0155 1.0082 1.0093 1.0158 1.0324 1.0181 1.0232 1.0198 1.0114 0.9975 0.9938 1.0027 1.0041 1.0084 1.0006 1.0116 1.0044 1.0041 1.0100 1.0055 0.9999 0.9996 1.0141 1.0079 0.9990 0.9986 1.0104 1.0164 1.0026 1.0129 1.0064 1.0082 1.0216 1.0070
dispcorr: -0.030597705 hartree
energy: -912.324888519244
dipole: 3.30506 -3.61696 -0.31190 -15.97851 15.91667 -0.06185 1.74693 -1.30518 0.44175
magnitude: 0.54429 au
magnitude: 1.38347 debye
