program: Orca
programVersion: 5.0.2
elementType: O O N C C C C C C C C C C C C C C C C C C H H H H H H H H H H H H H H H H H H H H H H H H H H H H H H H H H H H
charge: 0
multiplicity: 1
keywords: wb97x-d3
keywords: def2-TZVPP
keywords: def2/J RIJCOSX
keywords: DEFGRID2
keywords: scfconv7
keywords: smallprint printgap noloewdin
keywords: NOSOSCF
formula: C18H35NO2
InChI: InChI=1/C18H35NO2/c1-6-12-19(7-2)13-16-14-20-18(21-16)10-8-15(9-11-18)17(3,4)5/h15-16H,6-14H2,1-5H3
56 atoms
O  -0.242842 1.12812 -0.902115
O  -0.356108 2.711499 0.699128
N  -2.576937 -0.474507 -0.143671
C  3.018646 0.149189 0.322214
C  0.45821 1.682394 0.200584
C  2.742916 1.201782 -0.756568
C  1.685272 -0.462305 0.765165
C  4.095602 -0.894606 -0.076339
C  1.77565 2.275819 -0.269555
C  0.704608 0.60185 1.250537
C  -1.553456 1.645339 -0.944334
C  -1.68335 2.377005 0.387229
C  4.371962 -1.831683 1.103976
C  3.670882 -1.734282 -1.282744
C  5.409716 -0.180041 -0.41162
C  -2.598646 0.55764 -1.158985
C  -3.856782 -0.722426 0.48836
C  -1.850245 -1.659874 -0.564337
C  -4.929763 -1.405158 -0.362202
C  -1.561497 -2.628575 0.568516
C  -6.235223 -1.56283 0.404324
H  3.429659 0.684116 1.192213
H  3.667687 1.690375 -1.067636
H  2.328841 0.725039 -1.649528
H  1.236394 -1.016764 -0.063982
H  1.836799 -1.182775 1.570925
H  1.581962 3.006427 -1.058481
H  2.224445 2.821151 0.566433
H  1.106593 1.08445 2.146943
H  -0.246675 0.141628 1.531409
H  -1.638099 2.359266 -1.777378
H  -2.134601 1.730315 1.150112
H  -2.271882 3.292988 0.313393
H  4.630474 -1.27103 2.005362
H  3.519257 -2.468184 1.34114
H  5.210567 -2.4936 0.878739
H  3.495883 -1.121165 -2.167865
H  2.760789 -2.303284 -1.08717
H  4.451499 -2.453697 -1.538798
H  5.718967 0.485221 0.397968
H  6.212276 -0.904169 -0.565293
H  5.340517 0.414965 -1.322426
H  -2.483415 0.140118 -2.168067
H  -3.572799 1.058901 -1.16684
H  -3.692772 -1.314174 1.393689
H  -4.244362 0.238153 0.843951
H  -2.366775 -2.199046 -1.376242
H  -0.902051 -1.325574 -0.984317
H  -4.578842 -2.387681 -0.68987
H  -5.106472 -0.827293 -1.274559
H  -0.886841 -3.4122 0.223476
H  -1.083147 -2.118563 1.405161
H  -2.459805 -3.121543 0.941959
H  -6.095787 -2.163016 1.305203
H  -6.999386 -2.052157 -0.199086
H  -6.632944 -0.595467 0.71621
totalener: -912.29546961 hartree
nucrepener: 1934.60992802 hartree
electener: -2846.90539764 hartree
oneelecener: -5082.42661185 hartree
twoeener: 2235.52121421 hartree
kineticenergy: 907.82993987 hartree
xcener: -92.078132414703 hartree
chargesum: 0.0000000
charge: -0.389769 -0.336602 -0.185329 0.085840 0.578268 -0.207236 -0.267763 0.241031 -0.267445 -0.269463 0.208756 -0.017688 -0.328809 -0.346751 -0.326219 -0.145143 -0.117862 -0.118787 -0.074598 -0.276088 -0.255615 0.049094 0.082487 0.081738 0.082064 0.088556 0.068694 0.079273 0.087263 0.067729 0.056375 0.061643 0.082357 0.092905 0.086754 0.086035 0.092065 0.086241 0.089528 0.093233 0.085794 0.086920 0.091152 0.077513 0.086461 0.070589 0.076465 0.109926 0.058392 0.058461 0.091883 0.089829 0.083951 0.075108 0.087584 0.073210
qa: -0.3898 -0.3366 -0.1853 0.0858 0.5783 -0.2072 -0.2678 0.2410 -0.2674 -0.2695 0.2088 -0.0177 -0.3288 -0.3468 -0.3262 -0.1451 -0.1179 -0.1188 -0.0746 -0.2761 -0.2556 0.0491 0.0825 0.0817 0.0821 0.0886 0.0687 0.0793 0.0873 0.0677 0.0564 0.0616 0.0824 0.0929 0.0868 0.0860 0.0921 0.0862 0.0895 0.0932 0.0858 0.0869 0.0912 0.0775 0.0865 0.0706 0.0765 0.1099 0.0584 0.0585 0.0919 0.0898 0.0840 0.0751 0.0876 0.0732
va: 2.0210 2.0670 2.8442 3.7233 3.8077 3.9009 3.9771 3.7200 4.0708 3.9826 3.9099 3.9976 3.9304 3.9567 3.9301 3.9497 3.9789 3.8882 3.8288 3.9242 3.9582 1.0188 1.0138 1.0215 0.9970 1.0110 1.0308 1.0183 1.0263 1.0418 1.0024 1.0059 0.9923 1.0051 1.0030 1.0106 1.0038 1.0046 1.0079 1.0050 1.0107 1.0032 1.0027 1.0032 0.9940 0.9998 0.9991 1.0009 1.0102 1.0118 1.0086 1.0033 1.0004 1.0037 1.0047 1.0042
dispcorr: -0.031013434 hartree
energy: -912.326483047738
dipole: 1.28185 -1.87753 -0.59568 -16.49919 16.16657 -0.33262 0.83022 -0.98093 -0.15071
magnitude: 0.69870 au
magnitude: 1.77596 debye
