program: Orca
programVersion: 5.0.2
elementType: O O N C C C C C C C C C C C C C C C C C C H H H H H H H H H H H H H H H H H H H H H H H H H H H H H H H H H H H
charge: 0
multiplicity: 1
keywords: wb97x-d3
keywords: def2-TZVPP
keywords: def2/J RIJCOSX
keywords: DEFGRID2
keywords: scfconv7
keywords: smallprint printgap noloewdin
keywords: NOSOSCF
formula: C18H35NO2
InChI: InChI=1/C18H35NO2/c1-6-12-19(7-2)13-16-14-20-18(21-16)10-8-15(9-11-18)17(3,4)5/h15-16H,6-14H2,1-5H3
56 atoms
O  0.02371 0.172541 -0.541294
O  -0.284536 1.349044 1.359844
N  -3.550948 -0.44698 0.174134
C  3.580179 0.185067 0.001539
C  0.706375 0.784967 0.54395
C  2.795583 1.218038 -0.812906
C  2.604017 -0.876105 0.520941
C  4.813056 -0.398303 -0.7374
C  1.667939 1.84119 0.004528
C  1.472533 -0.260026 1.337878
C  -1.349333 0.498672 -0.47813
C  -1.390658 1.633157 0.539834
C  4.420435 -1.170264 -1.998661
C  5.767919 0.735414 -1.129361
C  5.580351 -1.339076 0.197887
C  -2.145907 -0.72727 -0.034498
C  -4.229571 -1.506952 0.89676
C  -4.265166 0.016604 -1.002112
C  -5.512851 -1.05753 1.586504
C  -4.315632 -0.935854 -2.196286
C  -5.297329 0.101898 2.54679
H  3.981167 0.709808 0.88245
H  3.451751 2.017432 -1.161035
H  2.3732 0.75034 -1.706603
H  2.175252 -1.433062 -0.316669
H  3.120816 -1.605387 1.146802
H  1.123934 2.572939 -0.599578
H  2.089124 2.384665 0.855925
H  1.881864 0.219688 2.232245
H  0.78144 -1.03398 1.681135
H  -1.669864 0.832693 -1.470307
H  -2.299036 1.626337 1.142666
H  -1.300464 2.613895 0.054238
H  3.903622 -0.538977 -2.7227
H  5.30948 -1.566172 -2.493938
H  3.771929 -2.018636 -1.775624
H  5.346565 1.393259 -1.889665
H  6.695633 0.330344 -1.538262
H  6.03191 1.350432 -0.265725
H  5.016548 -2.240185 0.440183
H  6.513824 -1.662999 -0.266535
H  5.836946 -0.844015 1.137509
H  -1.732779 -1.05869 0.922377
H  -1.958739 -1.545307 -0.748948
H  -4.443017 -2.384564 0.26519
H  -3.544363 -1.861082 1.671962
H  -5.284977 0.26391 -0.700882
H  -3.83338 0.967639 -1.324723
H  -5.910853 -1.919826 2.128182
H  -6.281193 -0.798816 0.852987
H  -4.784093 -1.887301 -1.943398
H  -4.898191 -0.491958 -3.003883
H  -3.32319 -1.151169 -2.593773
H  -4.555449 -0.151353 3.306085
H  -6.220462 0.365731 3.063024
H  -4.937868 0.987898 2.025632
totalener: -912.29494095 hartree
nucrepener: 1879.07742578 hartree
electener: -2791.37236673 hartree
oneelecener: -4971.24982565 hartree
twoeener: 2179.87745892 hartree
kineticenergy: 907.83178350 hartree
xcener: -92.077853654926 hartree
chargesum: -0.0000000
charge: -0.380960 -0.340216 -0.189754 0.077937 0.529955 -0.212900 -0.214193 0.227337 -0.271980 -0.258065 0.204962 0.009021 -0.339668 -0.326151 -0.325882 -0.198794 -0.096561 -0.083180 -0.106480 -0.255473 -0.245422 0.048125 0.081107 0.082309 0.085166 0.080907 0.065072 0.078584 0.082414 0.070387 0.076608 0.091529 0.062946 0.090149 0.088376 0.089928 0.086936 0.086123 0.092459 0.087018 0.086133 0.092892 0.084655 0.088847 0.078364 0.076060 0.083049 0.072389 0.066744 0.056057 0.081687 0.088182 0.078863 0.073940 0.088280 0.074180
qa: -0.3810 -0.3402 -0.1898 0.0779 0.5300 -0.2129 -0.2142 0.2273 -0.2720 -0.2581 0.2050 0.0090 -0.3397 -0.3262 -0.3259 -0.1988 -0.0966 -0.0832 -0.1065 -0.2555 -0.2454 0.0481 0.0811 0.0823 0.0852 0.0809 0.0651 0.0786 0.0824 0.0704 0.0766 0.0915 0.0629 0.0901 0.0884 0.0899 0.0869 0.0861 0.0925 0.0870 0.0861 0.0929 0.0847 0.0888 0.0784 0.0761 0.0830 0.0724 0.0667 0.0561 0.0817 0.0882 0.0789 0.0739 0.0883 0.0742
va: 2.0296 2.0604 2.8608 3.7061 3.8745 3.9222 3.9176 3.7368 4.0881 4.0370 3.8756 3.9689 3.9535 3.9311 3.9298 4.0092 3.9369 3.9702 3.8723 3.9153 3.9400 1.0181 1.0132 1.0219 1.0200 1.0145 1.0180 1.0220 1.0195 1.0243 0.9923 1.0135 0.9931 1.0041 1.0073 1.0044 1.0031 1.0104 1.0051 1.0034 1.0105 1.0050 1.0132 1.0031 1.0047 0.9994 0.9964 0.9954 1.0135 1.0060 1.0034 1.0123 1.0016 1.0042 1.0080 1.0113
dispcorr: -0.028883671 hartree
energy: -912.323824623948
dipole: 1.43455 -1.83291 -0.39837 -5.93819 5.86905 -0.06915 -3.66482 3.35355 -0.31126
magnitude: 0.51026 au
magnitude: 1.29697 debye
