program: Orca
programVersion: 5.0.2
elementType: O O N C C C C C C C C C C C C C C C C C C H H H H H H H H H H H H H H H H H H H H H H H H H H H H H H H H H H H
charge: 0
multiplicity: 1
keywords: wb97x-d3
keywords: def2-TZVPP
keywords: def2/J RIJCOSX
keywords: DEFGRID2
keywords: scfconv7
keywords: smallprint printgap noloewdin
keywords: NOSOSCF
formula: C18H35NO2
InChI: InChI=1/C18H35NO2/c1-6-12-19(7-2)13-16-14-20-18(21-16)10-8-15(9-11-18)17(3,4)5/h15-16H,6-14H2,1-5H3
56 atoms
O  -0.392891 0.977922 0.451056
O  -0.098801 3.142699 -0.06779
N  -3.150886 -0.48716 0.758129
C  3.050627 0.258092 -0.227852
C  0.572092 1.902395 0.0173
C  1.926659 0.200623 -1.267044
C  2.463061 0.662314 1.128372
C  3.917791 -1.028007 -0.178667
C  1.143444 1.507162 -1.343268
C  1.681487 1.970841 1.050091
C  -1.636965 1.393285 -0.064342
C  -1.486954 2.917047 -0.059527
C  4.590499 -1.248974 -1.537547
C  5.028689 -0.865358 0.864429
C  3.093412 -2.269261 0.171214
C  -2.777695 0.898872 0.817877
C  -3.82303 -0.901459 -0.450033
C  -2.254317 -1.45443 1.363851
C  -4.706941 -2.127201 -0.252982
C  -1.25351 -2.151753 0.444873
C  -5.465373 -2.489162 -1.521557
H  3.730609 1.068178 -0.533438
H  2.328075 -0.020673 -2.25743
H  1.239641 -0.614264 -1.02451
H  1.806266 -0.126753 1.505699
H  3.25557 0.783959 1.868277
H  0.343151 1.424323 -2.084904
H  1.796718 2.314431 -1.688061
H  2.355144 2.787234 0.773968
H  1.254816 2.223952 2.02347
H  -1.775966 1.024888 -1.092251
H  -1.93515 3.356774 0.841077
H  -1.962985 3.378686 -0.92921
H  3.872613 -1.471592 -2.327198
H  5.162044 -0.370127 -1.845009
H  5.284437 -2.090597 -1.491174
H  5.73188 -1.698712 0.810166
H  4.642961 -0.841021 1.883888
H  5.596436 0.05383 0.701399
H  3.739702 -3.146343 0.244983
H  2.580928 -2.165555 1.128767
H  2.339139 -2.489183 -0.585447
H  -3.664653 1.490565 0.561253
H  -2.531725 1.159835 1.853052
H  -4.460699 -0.072792 -0.775401
H  -3.134643 -1.093463 -1.29085
H  -1.709201 -0.944027 2.159613
H  -2.852752 -2.224312 1.862793
H  -5.404706 -1.926395 0.563373
H  -4.104502 -2.983937 0.060151
H  -1.747418 -2.763162 -0.312197
H  -0.602248 -1.442852 -0.06159
H  -0.621095 -2.820475 1.031156
H  -6.092377 -3.367924 -1.373015
H  -4.782804 -2.709646 -2.344082
H  -6.115091 -1.673966 -1.844579
totalener: -912.29301399 hartree
nucrepener: 1925.21004885 hartree
electener: -2837.50306284 hartree
oneelecener: -5063.36475956 hartree
twoeener: 2225.86169673 hartree
kineticenergy: 907.83588018 hartree
xcener: -92.080637227492 hartree
chargesum: 0.0000000
charge: -0.346124 -0.344726 -0.179240 0.096286 0.547094 -0.252990 -0.217772 0.230417 -0.269937 -0.233138 0.103024 0.047465 -0.326948 -0.327054 -0.351533 -0.159520 -0.092313 -0.065706 -0.079947 -0.237887 -0.258378 0.049949 0.088345 0.087672 0.080961 0.081367 0.072033 0.082600 0.078955 0.069588 0.071370 0.057371 0.064573 0.087259 0.092212 0.086766 0.086175 0.088188 0.093618 0.092699 0.091350 0.088279 0.082624 0.081336 0.075529 0.062214 0.073035 0.081439 0.066972 0.053816 0.079348 0.053343 0.085629 0.086224 0.073329 0.072755
qa: -0.3461 -0.3447 -0.1792 0.0963 0.5471 -0.2530 -0.2178 0.2304 -0.2699 -0.2331 0.1030 0.0475 -0.3269 -0.3271 -0.3515 -0.1595 -0.0923 -0.0657 -0.0799 -0.2379 -0.2584 0.0499 0.0883 0.0877 0.0810 0.0814 0.0720 0.0826 0.0790 0.0696 0.0714 0.0574 0.0646 0.0873 0.0922 0.0868 0.0862 0.0882 0.0936 0.0927 0.0913 0.0883 0.0826 0.0813 0.0755 0.0622 0.0730 0.0814 0.0670 0.0538 0.0793 0.0533 0.0856 0.0862 0.0733 0.0728
va: 2.0219 2.0639 2.9277 3.6775 3.8103 3.9751 3.9321 3.7382 4.0489 4.0196 3.8234 4.0155 3.9291 3.9294 3.9599 4.0689 3.9480 3.9640 3.8510 3.8497 3.9518 1.0182 1.0176 0.9940 1.0132 1.0142 1.0151 1.0238 1.0201 1.0355 0.9917 0.9908 0.9919 1.0033 1.0054 1.0102 1.0115 1.0010 1.0045 1.0093 1.0031 1.0010 0.9981 1.0142 0.9979 0.9854 1.0097 0.9854 1.0179 1.0097 1.0059 1.0136 1.0144 1.0063 1.0038 1.0037
dispcorr: -0.030501535 hartree
energy: -912.323515524362
dipole: 3.27418 -3.42270 -0.14852 -17.59809 17.41878 -0.17930 -3.75109 3.48043 -0.27066
magnitude: 0.35702 au
magnitude: 0.90748 debye
