program: Orca
programVersion: 5.0.2
elementType: O O N C C C C C C C C C C C C C C C C C C H H H H H H H H H H H H H H H H H H H H H H H H H H H H H H H H H H H
charge: 0
multiplicity: 1
keywords: wb97x-d3
keywords: def2-TZVPP
keywords: def2/J RIJCOSX
keywords: DEFGRID2
keywords: scfconv7
keywords: smallprint printgap noloewdin
keywords: NOSOSCF
formula: C18H35NO2
InChI: InChI=1/C18H35NO2/c1-6-12-19(7-2)13-16-14-20-18(21-16)10-8-15(9-11-18)17(3,4)5/h15-16H,6-14H2,1-5H3
56 atoms
O  -0.340999 0.930519 -0.363482
O  -0.108249 2.914214 0.66244
N  -2.954201 -0.790876 -0.265836
C  3.155173 0.259445 -0.084343
C  0.609364 1.782705 0.246671
C  2.476363 0.991322 -1.24656
C  2.092107 -0.135857 0.945704
C  4.062469 -0.91942 -0.528461
C  1.655575 2.188342 -0.775002
C  1.277332 1.064755 1.417763
C  -1.649718 1.31834 0.003021
C  -1.408339 2.487779 0.964503
C  3.264298 -2.053991 -1.176329
C  5.110769 -0.422795 -1.530874
C  4.815435 -1.476925 0.684048
C  -2.447009 0.199817 0.654535
C  -4.077624 -1.536779 0.271515
C  -1.947578 -1.633342 -0.89164
C  -5.389408 -0.761137 0.226681
C  -1.174228 -2.569159 0.034233
C  -6.559857 -1.59196 0.733416
H  3.82281 0.986192 0.403831
H  3.219469 1.347911 -1.961248
H  1.824768 0.304577 -1.793737
H  1.413894 -0.876569 0.513824
H  2.551731 -0.606661 1.816341
H  1.164973 2.675034 -1.621022
H  2.315765 2.930965 -0.316595
H  1.930058 1.776825 1.93208
H  0.526304 0.744605 2.146601
H  -2.188467 1.648063 -0.893483
H  -1.502622 2.166127 2.012419
H  -2.101339 3.315442 0.807302
H  2.545303 -2.499143 -0.486826
H  2.714826 -1.717865 -2.056761
H  3.934359 -2.852847 -1.500803
H  5.839278 -1.207692 -1.743574
H  5.660604 0.43641 -1.139513
H  4.671159 -0.130296 -2.484525
H  5.376483 -0.693214 1.198391
H  4.149941 -1.941451 1.411933
H  5.530486 -2.241312 0.373478
H  -3.308576 0.67571 1.13292
H  -1.849237 -0.226562 1.479691
H  -4.200992 -2.438608 -0.335037
H  -3.898993 -1.892804 1.300458
H  -2.455769 -2.227423 -1.656146
H  -1.242424 -1.000679 -1.429054
H  -5.567298 -0.44127 -0.802289
H  -5.315941 0.153291 0.821829
H  -0.614221 -2.020636 0.792037
H  -1.829842 -3.274534 0.547455
H  -0.451869 -3.151424 -0.539843
H  -7.492634 -1.029591 0.69842
H  -6.407383 -1.909395 1.766342
H  -6.697912 -2.492059 0.13202
totalener: -912.29501596 hartree
nucrepener: 1915.20525210 hartree
electener: -2827.50026807 hartree
oneelecener: -5043.38243677 hartree
twoeener: 2215.88216870 hartree
kineticenergy: 907.83051711 hartree
xcener: -92.075553928033 hartree
chargesum: -0.0000000
charge: -0.363298 -0.328015 -0.170208 0.089876 0.550502 -0.210202 -0.203367 0.232395 -0.265534 -0.288202 0.205930 -0.022329 -0.343205 -0.327150 -0.328321 -0.205847 -0.098099 -0.043092 -0.063300 -0.278512 -0.256724 0.050182 0.081446 0.083505 0.044348 0.084757 0.070076 0.079923 0.083716 0.070990 0.072318 0.059451 0.088140 0.082818 0.093430 0.090498 0.086182 0.094053 0.088883 0.091926 0.088299 0.086055 0.094727 0.075813 0.072632 0.064347 0.069009 0.080122 0.056646 0.045540 0.075368 0.091843 0.088008 0.085358 0.072381 0.073913
qa: -0.3633 -0.3280 -0.1702 0.0899 0.5505 -0.2102 -0.2034 0.2324 -0.2655 -0.2882 0.2059 -0.0223 -0.3432 -0.3271 -0.3283 -0.2058 -0.0981 -0.0431 -0.0633 -0.2785 -0.2567 0.0502 0.0814 0.0835 0.0443 0.0848 0.0701 0.0799 0.0837 0.0710 0.0723 0.0595 0.0881 0.0828 0.0934 0.0905 0.0862 0.0941 0.0889 0.0919 0.0883 0.0861 0.0947 0.0758 0.0726 0.0643 0.0690 0.0801 0.0566 0.0455 0.0754 0.0918 0.0880 0.0854 0.0724 0.0739
va: 2.0186 2.0714 2.9187 3.7083 3.8104 3.9147 3.9746 3.7417 4.0554 4.0381 3.7939 4.0135 3.9574 3.9278 3.9297 3.9944 3.9422 3.9375 3.8573 3.8834 3.9468 1.0181 1.0143 1.0161 1.0248 1.0156 1.0338 1.0177 1.0242 1.0189 1.0142 0.9962 0.9930 1.0028 1.0043 1.0090 1.0112 1.0043 1.0014 1.0052 1.0033 1.0101 0.9974 1.0056 0.9986 0.9951 0.9988 1.0197 1.0235 1.0159 0.9985 1.0036 1.0144 1.0065 1.0036 1.0038
dispcorr: -0.030045156 hartree
energy: -912.325061119858
dipole: 1.92261 -2.13014 -0.20753 -16.43572 16.16518 -0.27055 0.38939 -0.07841 0.31098
magnitude: 0.46149 au
magnitude: 1.17301 debye
