program: Orca
programVersion: 5.0.2
elementType: O O N C C C C C C C C C C C C C C C C C C H H H H H H H H H H H H H H H H H H H H H H H H H H H H H H H H H H H
charge: 0
multiplicity: 1
keywords: wb97x-d3
keywords: def2-TZVPP
keywords: def2/J RIJCOSX
keywords: DEFGRID2
keywords: scfconv7
keywords: smallprint printgap noloewdin
keywords: NOSOSCF
formula: C18H35NO2
InChI: InChI=1/C18H35NO2/c1-6-12-19(7-2)13-16-14-20-18(21-16)10-8-15(9-11-18)17(3,4)5/h15-16H,6-14H2,1-5H3
56 atoms
O  0.099694 0.094738 -0.582931
O  -0.345655 1.580595 1.058814
N  -3.450168 -0.682043 0.05069
C  3.621239 0.413657 0.014524
C  0.705564 0.937519 0.386575
C  2.806444 1.238151 -0.986972
C  2.689581 -0.584829 0.709828
C  4.895988 -0.233049 -0.589012
C  1.6230 1.932201 -0.318995
C  1.503186 0.103981 1.376509
C  -1.294836 0.310746 -0.590534
C  -1.446071 1.61401 0.182781
C  4.56767 -1.261481 -1.674496
C  5.79334 0.852786 -1.193721
C  5.69822 -0.92625 0.518057
C  -2.015325 -0.858737 0.077946
C  -4.149598 -1.387941 1.104397
C  -4.041653 -0.853329 -1.270335
C  -5.555464 -0.860234 1.356522
C  -4.717793 0.407134 -1.789036
C  -6.222043 -1.564335 2.529552
H  3.978725 1.11165 0.787311
H  3.430102 1.999059 -1.458813
H  2.437379 0.595278 -1.790886
H  2.315614 -1.314278 -0.013961
H  3.228108 -1.152386 1.470602
H  1.057031 2.506689 -1.058027
H  1.987731 2.647931 0.424303
H  1.858553 0.761724 2.175553
H  0.84472 -0.634226 1.841505
H  -1.627435 0.417266 -1.62889
H  -2.37105 1.657149 0.758082
H  -1.41295 2.485475 -0.484393
H  4.012854 -0.822002 -2.504612
H  5.485866 -1.683404 -2.088521
H  3.978601 -2.093641 -1.286914
H  6.002994 1.644725 -0.470842
H  5.351617 1.316421 -2.076133
H  6.751296 0.429786 -1.502454
H  5.175785 -1.787287 0.935283
H  6.651761 -1.290125 0.130419
H  5.918721 -0.240186 1.339082
H  -1.690672 -0.902825 1.121265
H  -1.685734 -1.798977 -0.393318
H  -4.203236 -2.474929 0.913403
H  -3.573974 -1.271178 2.026743
H  -3.271904 -1.166965 -1.983686
H  -4.765779 -1.676992 -1.257153
H  -6.17522 -0.986852 0.464557
H  -5.497004 0.214956 1.543239
H  -5.149858 0.242021 -2.777311
H  -5.516556 0.731187 -1.122414
H  -4.0061 1.229798 -1.868235
H  -5.657713 -1.421002 3.45247
H  -6.300862 -2.639076 2.357386
H  -7.229535 -1.185968 2.700335
totalener: -912.29557997 hartree
nucrepener: 1864.05573160 hartree
electener: -2776.35131156 hartree
oneelecener: -4941.14924815 hartree
twoeener: 2164.79793659 hartree
kineticenergy: 907.83106559 hartree
xcener: -92.071777001455 hartree
chargesum: -0.0000000
charge: -0.379695 -0.341671 -0.196652 0.082064 0.531145 -0.214397 -0.215283 0.227559 -0.269022 -0.259212 0.210254 0.011319 -0.340629 -0.327008 -0.326125 -0.189805 -0.083983 -0.071011 -0.071399 -0.230089 -0.262881 0.047332 0.081450 0.083018 0.084517 0.081043 0.064513 0.077605 0.082807 0.070609 0.075896 0.083630 0.062103 0.090532 0.088100 0.089878 0.093159 0.086399 0.086092 0.087131 0.085832 0.092444 0.081132 0.084338 0.064497 0.065174 0.074730 0.071890 0.051210 0.063170 0.082717 0.078810 0.070517 0.075109 0.072717 0.086422
qa: -0.3797 -0.3417 -0.1967 0.0821 0.5311 -0.2144 -0.2153 0.2276 -0.2690 -0.2592 0.2103 0.0113 -0.3406 -0.3270 -0.3261 -0.1898 -0.0840 -0.0710 -0.0714 -0.2301 -0.2629 0.0473 0.0814 0.0830 0.0845 0.0810 0.0645 0.0776 0.0828 0.0706 0.0759 0.0836 0.0621 0.0905 0.0881 0.0899 0.0932 0.0864 0.0861 0.0871 0.0858 0.0924 0.0811 0.0843 0.0645 0.0652 0.0747 0.0719 0.0512 0.0632 0.0827 0.0788 0.0705 0.0751 0.0727 0.0864
va: 2.0359 2.0598 2.8246 3.7071 3.8704 3.9223 3.9232 3.7372 4.0864 4.0393 3.8712 3.9483 3.9534 3.9314 3.9295 3.9888 3.9480 3.8732 3.8431 3.9298 3.9657 1.0179 1.0130 1.0222 1.0193 1.0142 1.0185 1.0218 1.0194 1.0232 0.9964 1.0236 0.9934 1.0046 1.0071 1.0040 1.0048 1.0026 1.0107 1.0037 1.0104 1.0052 1.0090 1.0161 1.0021 1.0038 1.0046 1.0036 1.0072 1.0148 1.0122 1.0049 1.0079 1.0036 1.0044 1.0055
dispcorr: -0.028311337 hartree
energy: -912.323891303068
dipole: 0.10536 -0.49155 -0.38619 -6.34600 6.17610 -0.16990 -1.80037 1.59545 -0.20492
magnitude: 0.46905 au
magnitude: 1.19222 debye
