program: Orca
programVersion: 5.0.2
elementType: O O N C C C C C C C C C C C C C C C C C C H H H H H H H H H H H H H H H H H H H H H H H H H H H H H H H H H H H
charge: 0
multiplicity: 1
keywords: wb97x-d3
keywords: def2-TZVPP
keywords: def2/J RIJCOSX
keywords: DEFGRID2
keywords: scfconv7
keywords: smallprint printgap noloewdin
keywords: NOSOSCF
formula: C18H35NO2
InChI: InChI=1/C18H35NO2/c1-6-12-19(7-2)13-16-14-20-18(21-16)10-8-15(9-11-18)17(3,4)5/h15-16H,6-14H2,1-5H3
56 atoms
O  -0.71717 1.006475 -0.19488
O  -0.16833 3.049826 0.585293
N  -3.342883 -0.447382 0.034057
C  2.696708 -0.050888 -0.006409
C  0.368349 1.792657 0.261894
C  2.041805 0.623781 -1.216029
C  1.651476 -0.214186 1.10196
C  3.458242 -1.359053 -0.350056
C  1.39227 1.954125 -0.848157
C  1.006185 1.118077 1.473214
C  -1.934922 1.684139 0.022145
C  -1.521611 2.863096 0.902712
C  2.521713 -2.465114 -0.841881
C  4.50255 -1.080893 -1.43671
C  4.2067 -1.862209 0.889065
C  -2.968076 0.777995 0.68581
C  -2.429897 -1.57045 0.078677
C  -4.089276 -0.333359 -1.197391
C  -1.966046 -1.942431 1.480376
C  -3.293876 -0.22871 -2.500844
C  -1.209059 -3.263354 1.487554
H  3.459399 0.646605 0.372546
H  2.777748 0.809802 -1.99955
H  1.28476 -0.035098 -1.650696
H  0.87355 -0.912981 0.782305
H  2.101884 -0.642338 1.9988
H  0.910138 2.399353 -1.721647
H  2.15894 2.65934 -0.513163
H  1.764327 1.792436 1.882883
H  0.258773 0.969382 2.258656
H  -2.323748 2.054173 -0.936155
H  -1.666714 2.633903 1.969061
H  -2.069399 3.779753 0.680141
H  1.80564 -2.766943 -0.076168
H  1.95646 -2.164675 -1.725247
H  3.093829 -3.354977 -1.112634
H  5.151551 -0.246017 -1.161969
H  4.049692 -0.847572 -2.400438
H  5.139503 -1.954704 -1.586962
H  4.829786 -2.723028 0.638616
H  4.863098 -1.090308 1.297424
H  3.532164 -2.179395 1.684654
H  -3.876978 1.376806 0.824158
H  -2.616749 0.543281 1.694519
H  -2.976217 -2.428398 -0.330943
H  -1.544285 -1.443703 -0.559714
H  -4.747566 -1.206618 -1.275578
H  -4.754164 0.530835 -1.108507
H  -2.834292 -2.004514 2.14175
H  -1.315291 -1.162394 1.883271
H  -2.636363 0.639186 -2.525174
H  -2.674044 -1.110746 -2.664439
H  -3.9773 -0.152262 -3.347804
H  -0.343293 -3.228884 0.823488
H  -1.841796 -4.088449 1.157173
H  -0.844485 -3.507499 2.4852
totalener: -912.29182099 hartree
nucrepener: 1973.71344544 hartree
electener: -2886.00526643 hartree
oneelecener: -5160.42810596 hartree
twoeener: 2274.42283953 hartree
kineticenergy: 907.83290435 hartree
xcener: -92.080795838038 hartree
chargesum: -0.0000000
charge: -0.350990 -0.329102 -0.166666 0.088038 0.560372 -0.208407 -0.172943 0.240540 -0.265426 -0.301701 0.130620 0.009903 -0.351188 -0.328438 -0.328273 -0.168933 -0.066804 -0.077063 -0.107511 -0.233101 -0.269664 0.050026 0.081820 0.081021 0.020058 0.089939 0.068823 0.079464 0.085957 0.073092 0.070705 0.055568 0.086438 0.083223 0.094088 0.092453 0.093823 0.088696 0.086312 0.086476 0.092515 0.087321 0.086290 0.074037 0.075814 0.061894 0.074768 0.063907 0.082747 0.048123 0.078962 0.078473 0.085870 0.065096 0.085579 0.087357
qa: -0.3510 -0.3291 -0.1667 0.0880 0.5604 -0.2084 -0.1729 0.2405 -0.2654 -0.3017 0.1306 0.0099 -0.3512 -0.3284 -0.3283 -0.1689 -0.0668 -0.0771 -0.1075 -0.2331 -0.2697 0.0500 0.0818 0.0810 0.0201 0.0899 0.0688 0.0795 0.0860 0.0731 0.0707 0.0556 0.0864 0.0832 0.0941 0.0925 0.0938 0.0887 0.0863 0.0865 0.0925 0.0873 0.0863 0.0740 0.0758 0.0619 0.0748 0.0639 0.0827 0.0481 0.0790 0.0785 0.0859 0.0651 0.0856 0.0874
va: 2.0073 2.0725 2.9322 3.7247 3.8120 3.9123 3.9579 3.7308 4.0526 4.0504 3.7701 4.0294 3.9681 3.9310 3.9314 4.0556 3.9409 3.9772 3.8474 3.8727 3.9491 1.0184 1.0154 1.0187 1.0329 1.0129 1.0307 1.0189 1.0266 1.0148 0.9909 0.9979 0.9944 0.9959 1.0045 1.0104 1.0042 1.0016 1.0111 1.0104 1.0049 1.0036 1.0079 1.0053 0.9910 0.9846 0.9961 1.0034 1.0173 1.0066 1.0045 1.0032 1.0128 1.0016 1.0053 1.0064
dispcorr: -0.032220859 hartree
energy: -912.324041852191
dipole: 6.58568 -6.72926 -0.14358 -16.92726 16.92771 0.00045 -2.47284 2.52179 0.04894
magnitude: 0.15170 au
magnitude: 0.38559 debye
