program: Orca
programVersion: 5.0.2
elementType: O O N C C C C C C C C C C C C C C C C C C H H H H H H H H H H H H H H H H H H H H H H H H H H H H H H H H H H H
charge: 0
multiplicity: 1
keywords: wb97x-d3
keywords: def2-TZVPP
keywords: def2/J RIJCOSX
keywords: DEFGRID2
keywords: scfconv7
keywords: smallprint printgap noloewdin
keywords: NOSOSCF
formula: C18H35NO2
InChI: InChI=1/C18H35NO2/c1-6-12-19(7-2)13-16-14-20-18(21-16)10-8-15(9-11-18)17(3,4)5/h15-16H,6-14H2,1-5H3
56 atoms
O  0.034799 -0.219731 -0.438956
O  -0.550288 1.695002 0.604763
N  -3.56964 -0.810746 0.085574
C  3.491808 0.383091 0.36159
C  0.554068 0.898097 0.266571
C  2.782943 0.816827 -0.925588
C  2.496578 -0.386236 1.236729
C  4.833055 -0.360197 0.126022
C  1.537486 1.646281 -0.629408
C  1.248018 0.436528 1.537523
C  -1.350543 -0.04246 -0.645192
C  -1.556495 1.435912 -0.343771
C  5.497777 -0.670144 1.47178
C  4.644572 -1.669952 -0.642559
C  5.790366 0.541243 -0.661144
C  -2.146151 -0.948042 0.291281
C  -4.054432 -1.443572 -1.132547
C  -4.365299 -1.078839 1.269965
C  -4.6139 -0.444127 -2.140526
C  -4.290312 0.035363 2.300995
C  -5.777595 0.368565 -1.59559
H  3.752988 1.302776 0.907704
H  3.449113 1.408249 -1.555647
H  2.498252 -0.061128 -1.512143
H  2.202279 -1.315865 0.74161
H  2.954348 -0.672099 2.185079
H  1.04718 1.93664 -1.562973
H  1.824752 2.572674 -0.122471
H  1.52096 1.320526 2.122167
H  0.545532 -0.140654 2.144129
H  -1.583753 -0.279495 -1.688941
H  -2.533184 1.646698 0.092091
H  -1.440081 2.052127 -1.245187
H  5.597955 0.229792 2.083248
H  4.942035 -1.406637 2.052547
H  6.500061 -1.075483 1.320029
H  4.210729 -1.507428 -1.63006
H  4.000776 -2.370091 -0.108276
H  5.606085 -2.165868 -0.790997
H  5.450108 0.722906 -1.680852
H  5.914084 1.511095 -0.173515
H  6.778427 0.082435 -0.732279
H  -1.903732 -0.661947 1.317518
H  -1.799531 -1.986976 0.168232
H  -3.248594 -2.017027 -1.604802
H  -4.829745 -2.181921 -0.894457
H  -5.406204 -1.178404 0.957445
H  -4.096271 -2.039304 1.739782
H  -4.926466 -0.989649 -3.035799
H  -3.815463 0.23299 -2.457449
H  -4.925945 -0.195764 3.156306
H  -3.280723 0.189394 2.682398
H  -4.628912 0.977987 1.87041
H  -5.472828 0.940726 -0.718968
H  -6.61131 -0.273437 -1.303328
H  -6.153237 1.073115 -2.337623
totalener: -912.29483722 hartree
nucrepener: 1888.90568735 hartree
electener: -2801.20052457 hartree
oneelecener: -4990.88143488 hartree
twoeener: 2189.68091032 hartree
kineticenergy: 907.84267681 hartree
xcener: -92.075012066959 hartree
chargesum: -0.0000000
charge: -0.383938 -0.342175 -0.209994 0.079581 0.531424 -0.214597 -0.214077 0.227251 -0.272473 -0.258343 0.237822 0.009332 -0.326645 -0.339068 -0.326222 -0.229934 -0.103645 -0.075488 -0.078126 -0.239111 -0.258066 0.048056 0.080873 0.082900 0.084096 0.081486 0.065321 0.078299 0.082248 0.069020 0.075966 0.082192 0.066020 0.093076 0.086617 0.086127 0.089892 0.089773 0.088745 0.086910 0.092737 0.085914 0.094724 0.086436 0.077900 0.080757 0.074810 0.078568 0.063665 0.051327 0.087700 0.080356 0.072448 0.077442 0.074172 0.089921
qa: -0.3839 -0.3422 -0.2100 0.0796 0.5314 -0.2146 -0.2141 0.2273 -0.2725 -0.2583 0.2378 0.0093 -0.3266 -0.3391 -0.3262 -0.2299 -0.1036 -0.0755 -0.0781 -0.2391 -0.2581 0.0481 0.0809 0.0829 0.0841 0.0815 0.0653 0.0783 0.0822 0.0690 0.0760 0.0822 0.0660 0.0931 0.0866 0.0861 0.0899 0.0898 0.0887 0.0869 0.0927 0.0859 0.0947 0.0864 0.0779 0.0808 0.0748 0.0786 0.0637 0.0513 0.0877 0.0804 0.0724 0.0774 0.0742 0.0899
va: 2.0386 2.0596 2.7469 3.7046 3.8771 3.9258 3.9246 3.7350 4.0839 4.0405 3.8419 3.9585 3.9306 3.9530 3.9311 4.0106 3.9028 3.9102 3.8539 3.9210 3.9179 1.0180 1.0133 1.0216 1.0196 1.0139 1.0186 1.0221 1.0198 1.0243 0.9983 1.0170 0.9946 1.0048 1.0032 1.0108 1.0041 1.0044 1.0070 1.0035 1.0049 1.0106 1.0000 1.0207 1.0113 1.0025 0.9912 1.0030 1.0185 1.0134 1.0135 1.0056 1.0095 1.0158 1.0043 1.0100
dispcorr: -0.029516026 hartree
energy: -912.324353246829
dipole: 1.91108 -2.25406 -0.34298 -4.26759 4.03310 -0.23449 -0.29834 0.12807 -0.17026
magnitude: 0.44901 au
magnitude: 1.14129 debye
