program: Orca
programVersion: 5.0.2
elementType: O O N C C C C C C C C C C C C C C C C C C H H H H H H H H H H H H H H H H H H H H H H H H H H H H H H H H H H H
charge: 0
multiplicity: 1
keywords: wb97x-d3
keywords: def2-TZVPP
keywords: def2/J RIJCOSX
keywords: DEFGRID2
keywords: scfconv7
keywords: smallprint printgap noloewdin
keywords: NOSOSCF
formula: C18H35NO2
InChI: InChI=1/C18H35NO2/c1-6-12-19(7-2)13-16-14-20-18(21-16)10-8-15(9-11-18)17(3,4)5/h15-16H,6-14H2,1-5H3
56 atoms
O  -0.572102 0.775128 -0.252872
O  -0.384282 2.641219 0.993784
N  -3.403542 -0.50699 -0.181083
C  2.876267 0.014986 0.156976
C  0.350952 1.568247 0.47089
C  2.281161 0.84679 -0.984646
C  1.752327 -0.418994 1.103954
C  3.772624 -1.161007 -0.315346
C  1.463573 2.028346 -0.466663
C  0.943374 0.765952 1.616468
C  -1.800759 1.459325 -0.398878
C  -1.487056 2.854374 0.154049
C  4.480115 -1.783996 0.892669
C  2.969085 -2.250714 -1.030118
C  4.856624 -0.644554 -1.268137
C  -2.927619 0.748801 0.355525
C  -2.482246 -1.629416 -0.136349
C  -4.054044 -0.408268 -1.473009
C  -1.985215 -1.979735 1.257517
C  -5.206016 0.583039 -1.513179
C  -1.148973 -3.252196 1.245343
H  3.536669 0.687571 0.725851
H  3.072898 1.233944 -1.627631
H  1.64467 0.220881 -1.616139
H  1.07873 -1.110531 0.590659
H  2.155595 -0.960797 1.96115
H  1.043932 2.591029 -1.305903
H  2.11459 2.717249 0.080671
H  1.584478 1.427578 2.207034
H  0.14108 0.429841 2.27824
H  -2.050327 1.518044 -1.465056
H  -2.303029 3.277121 0.744771
H  -1.257178 3.56135 -0.653506
H  3.784426 -2.259782 1.58409
H  5.185349 -2.55302 0.571354
H  5.045064 -1.034777 1.452132
H  2.428858 -1.86183 -1.894548
H  2.241491 -2.726313 -0.37058
H  3.634001 -3.037498 -1.392293
H  4.448242 -0.308669 -2.221435
H  5.408047 0.190107 -0.828633
H  5.578887 -1.432609 -1.490144
H  -3.780108 1.432424 0.405342
H  -2.617624 0.604446 1.394058
H  -3.031565 -2.496731 -0.518339
H  -1.61827 -1.503175 -0.806415
H  -3.351322 -0.179717 -2.292667
H  -4.453797 -1.399524 -1.702812
H  -2.843967 -2.098326 1.923266
H  -1.380132 -1.16739 1.663002
H  -5.887218 0.417167 -0.678227
H  -4.877748 1.622536 -1.482615
H  -5.769217 0.456796 -2.437841
H  -0.780816 -3.495331 2.241916
H  -0.279927 -3.147461 0.592898
H  -1.724717 -4.10808 0.889073
totalener: -912.29306912 hartree
nucrepener: 1956.19647281 hartree
electener: -2868.48954193 hartree
oneelecener: -5125.40351948 hartree
twoeener: 2256.91397755 hartree
kineticenergy: 907.82878406 hartree
xcener: -92.078084161773 hartree
chargesum: 0.0000000
charge: -0.359154 -0.331129 -0.147369 0.097437 0.549578 -0.217576 -0.201270 0.232773 -0.269405 -0.292228 0.172258 -0.001774 -0.327311 -0.344289 -0.327486 -0.238390 -0.080543 -0.072932 -0.095002 -0.255562 -0.269450 0.050206 0.080876 0.080564 0.046612 0.089907 0.064603 0.077652 0.090618 0.083039 0.083219 0.071389 0.068467 0.088979 0.086111 0.091204 0.094243 0.083676 0.090604 0.088156 0.093877 0.086168 0.088009 0.114902 0.074638 0.067039 0.062261 0.073484 0.079752 0.046915 0.089705 0.068751 0.087093 0.087582 0.064739 0.083782
qa: -0.3592 -0.3311 -0.1474 0.0974 0.5496 -0.2176 -0.2013 0.2328 -0.2694 -0.2922 0.1723 -0.0018 -0.3273 -0.3443 -0.3275 -0.2384 -0.0805 -0.0729 -0.0950 -0.2556 -0.2694 0.0502 0.0809 0.0806 0.0466 0.0899 0.0646 0.0777 0.0906 0.0830 0.0832 0.0714 0.0685 0.0890 0.0861 0.0912 0.0942 0.0837 0.0906 0.0882 0.0939 0.0862 0.0880 0.1149 0.0746 0.0670 0.0623 0.0735 0.0798 0.0469 0.0897 0.0688 0.0871 0.0876 0.0647 0.0838
va: 2.0048 2.0676 2.9535 3.7096 3.8460 3.9274 3.9435 3.7373 4.0721 4.0207 3.7278 4.0373 3.9302 3.9632 3.9308 4.0705 3.9384 3.9366 3.8295 3.9072 3.9528 1.0179 1.0132 1.0227 1.0213 1.0135 1.0170 1.0225 1.0214 1.0239 0.9961 0.9962 0.9909 1.0039 1.0097 1.0054 1.0049 1.0001 1.0089 1.0005 1.0039 1.0117 0.9996 1.0012 0.9984 1.0014 0.9930 0.9963 1.0213 1.0218 1.0113 1.0003 1.0092 1.0057 1.0008 1.0051
dispcorr: -0.031401782 hartree
energy: -912.324470899812
dipole: 5.80872 -5.86317 -0.05445 -13.66128 13.84511 0.18383 -3.45438 3.07355 -0.38083
magnitude: 0.42637 au
magnitude: 1.08374 debye
